﻿"Dublin Core:Title","Dublin Core:Subject","Dublin Core:Description","Dublin Core:Creator","Dublin Core:Source","Dublin Core:Publisher","Dublin Core:Date","Dublin Core:Contributor","Dublin Core:Rights","Dublin Core:Relation","Dublin Core:Format","Dublin Core:Language","Dublin Core:Type","Dublin Core:Identifier","Dublin Core:Coverage","Item Type Metadata:Text","Item Type Metadata:Interviewer","Item Type Metadata:Interviewee","Item Type Metadata:Location","Item Type Metadata:Transcription","Item Type Metadata:Local URL","Item Type Metadata:Original Format","Item Type Metadata:Physical Dimensions","Item Type Metadata:Duration","Item Type Metadata:Compression","Item Type Metadata:Producer","Item Type Metadata:Director","Item Type Metadata:Bit Rate/Frequency","Item Type Metadata:Time Summary","Item Type Metadata:Email Body","Item Type Metadata:Subject Line","Item Type Metadata:From","Item Type Metadata:To","Item Type Metadata:CC","Item Type Metadata:BCC","Item Type Metadata:Number of Attachments","Item Type Metadata:Standards","Item Type Metadata:Objectives","Item Type Metadata:Materials","Item Type Metadata:Lesson Plan Text","Item Type Metadata:URL","Item Type Metadata:Event Type","Item Type Metadata:Participants","Item Type Metadata:Birth Date","Item Type Metadata:Birthplace","Item Type Metadata:Death Date","Item Type Metadata:Occupation","Item Type Metadata:Biographical Text","Item Type Metadata:Bibliography",tags,file,itemType,collection,public,featured
"A. L'Autruche. B. L'Aigle. C. Le Faucon",,,,,,,,,,"Image pleine page",,"Gravure sur cuivre",X_348_021_web,,,,,,,,,,,,,,,,,,,,,,,,,,,,,,,,,,,,"Aigle,Animal,Autruche,Faucon,Oiseau,Zoologie",https://hieronyma.ict-toulouse.fr/files/original/426d5b4e2d88b69219e1b629749f7607.jpg,"Image fixe","Le Spectacle de la Nature",1,0
"A. L'Elephant apprivoisé. B. Le Chameau chargé. C. Le Chameau abaissé pour être déchargé.",,,,,,,,,,"Image pleine page",,"Gravure sur cuivre",X_348_022_web,,,,,,,,,,,,,,,,,,,,,,,,,,,,,,,,,,,,"Animal,Chameau,Éléphant,Transport à dos d'animal,Zoologie",https://hieronyma.ict-toulouse.fr/files/original/645bbc577a79c0a613f4711dacbd4ae7.jpg,"Image fixe","Le Spectacle de la Nature",1,0
"A. Le Porc-épi. B. Le Herisson. C. Le Castor.",,,,,,,,,,"Image pleine page",,"Gravure sur cuivre",X_348_023_web,,,,,,,,,,,,,,,,,,,,,,,,,,,,,,,,,,,,"Animal,Castor,Hérisson,JEP2017,Porc-épic,Zoologie",https://hieronyma.ict-toulouse.fr/files/original/8404a7702a57bc5dd9cf7e0fa33bc86d.jpg,"Image fixe","Le Spectacle de la Nature",1,0
"Hyménoptères, pl. 15 : Scolies",,,,,,,,,,Planche,,,planches_002_web,,,,,,,,,,,,,,,,,,,,,,,,,,,,,,,,,,,,"Animal,Insecte,Planche zoologique,Zoologie",https://hieronyma.ict-toulouse.fr/files/original/9499197e4364a7ddf7fcfdead2db8418.jpg,"Image fixe","Description de l'Egypte",1,0
"Hyménoptères, pl.19 : Mutilles",,,,,,,,,,Planche,,,planches_001_web,,,,,,,,,,,,,,,,,,,,,,,,,,,,,,,,,,,,"Animal,Insecte,Planche zoologique,Zoologie",https://hieronyma.ict-toulouse.fr/files/original/2a8beac8e7fab39aaba4aab31fd52bb4.jpg,"Image fixe","Description de l'Egypte",1,0
L'Oiseau-Mouche,,,,,,,,,,"Image pleine page",,"Gravure sur cuivre",X_348_020_web,,,,,,,,,,,,,,,,,,,,,,,,,,,,,,,,,,,,"Animal,Branche,Colibri,JEP2017,Oiseau,Zoologie",https://hieronyma.ict-toulouse.fr/files/original/dcb322492193acc0bf37f4ba1e9f599d.jpg,"Image fixe","Le Spectacle de la Nature",1,1
"La Femelle du Colibri",,,,,,,,,,"Image pleine page",,"Gravure sur cuivre",X_348_019_web,,,,,,,,,,,,,,,,,,,,,,,,,,,,,,,,,,,,"Animal,Colibri,Femelle,Nid,Oiseau,Zoologie",https://hieronyma.ict-toulouse.fr/files/original/b44305bad414f0b34f64fb72015b3d8d.jpg,"Image fixe","Le Spectacle de la Nature",1,0
"La Moule et la Pinne marine",,,,,,,,,,"Image pleine page",,"Gravure sur cuivre",X_348_016_web,,,,,,,,,,,,,,,,,,,,,,,,,,,,,,,,,,,,"Animal,Coquillage,Moule coquillage,Rocher,Zoologie",https://hieronyma.ict-toulouse.fr/files/original/68bc27adbcf7227d045c265872be81a1.jpg,"Image fixe","Le Spectacle de la Nature",1,0
"Le dedans du Guêpier",,,,,,,,,,"Image pleine page",,"Gravure sur cuivre",X_348_011_web,,,,,,,,,,,,,,,,,,,,,,,,,,,,,,,,,,,,"Animal,Guêpe,Insecte,Intérieur,Nid,Zoologie",https://hieronyma.ict-toulouse.fr/files/original/a1eda9670bef4c04587c0e914d9ed84b.jpg,"Image fixe","Le Spectacle de la Nature",1,0
"Le Fourmilion",,,,,,,,,,"Image pleine page",,"Gravure sur cuivre",X_348_015_web,,,,,,,,,,,,,,,,,,,,,,,,,,,,,,,,,,,,"Animal,Fourmilion,Insecte,JEP2017,Piège,Zoologie",https://hieronyma.ict-toulouse.fr/files/original/768b58722694b5d1182dbd3eedccd9d5.jpg,"Image fixe","Le Spectacle de la Nature",1,0
