﻿"Dublin Core:Title","Dublin Core:Subject","Dublin Core:Description","Dublin Core:Creator","Dublin Core:Source","Dublin Core:Publisher","Dublin Core:Date","Dublin Core:Contributor","Dublin Core:Rights","Dublin Core:Relation","Dublin Core:Format","Dublin Core:Language","Dublin Core:Type","Dublin Core:Identifier","Dublin Core:Coverage","Item Type Metadata:Text","Item Type Metadata:Interviewer","Item Type Metadata:Interviewee","Item Type Metadata:Location","Item Type Metadata:Transcription","Item Type Metadata:Local URL","Item Type Metadata:Original Format","Item Type Metadata:Physical Dimensions","Item Type Metadata:Duration","Item Type Metadata:Compression","Item Type Metadata:Producer","Item Type Metadata:Director","Item Type Metadata:Bit Rate/Frequency","Item Type Metadata:Time Summary","Item Type Metadata:Email Body","Item Type Metadata:Subject Line","Item Type Metadata:From","Item Type Metadata:To","Item Type Metadata:CC","Item Type Metadata:BCC","Item Type Metadata:Number of Attachments","Item Type Metadata:Standards","Item Type Metadata:Objectives","Item Type Metadata:Materials","Item Type Metadata:Lesson Plan Text","Item Type Metadata:URL","Item Type Metadata:Event Type","Item Type Metadata:Participants","Item Type Metadata:Birth Date","Item Type Metadata:Birthplace","Item Type Metadata:Death Date","Item Type Metadata:Occupation","Item Type Metadata:Biographical Text","Item Type Metadata:Bibliography",tags,file,itemType,collection,public,featured
"Les Mages guidés par une étoile mystérieuse.",,,,,,,,,,Planche,,"Gravure sur acier",1133_SAI_2_036_web,,,,,,,,,,,,,,,,,,,,,,,,,,,,,,,,,,,,"Caravane,Dromadaire,Étoile,Évangile selon saint Matthieu,Les Mages,Nuit,Voyage,Voyageur",https://hieronyma.ict-toulouse.fr/files/original/7d817713022468e34286263955816af6.JPG,,"La Sainte Bible : traduction nouvelle selon la Vulgate",1,0
"Fuite en Égypte",,,,,,,,,,Planche,,"Gravure sur acier",1133_SAI_2_037_web,,,,,,,,,,,,,,,,,,,,,,,,,,,,,,,,,,,,"Âne,Désert,Enfance du Christ,Enfant Jésus,Évangile selon saint Matthieu,Fuite en Égypte,Saint Joseph,Vierge,Voyage",https://hieronyma.ict-toulouse.fr/files/original/c884e68add3d5e80040cdfcc8d449818.JPG,,"La Sainte Bible : traduction nouvelle selon la Vulgate",1,0
"Carte des voyages de Télémaque Selon Mons[ieu]r Fenelon par le S[ieu]r Roussel",,,,,,,,,,Carte,français,"Gravure sur cuivre",FD_487-2_015_web,,,,,,,,,,,,,,,,,,,,,,,,,,,,,,,,,,,,"Carte,Mer Méditerranée,Phylactère,Voyage",https://hieronyma.ict-toulouse.fr/files/original/4301a38b31ddcd8cf509009fe54c0581.jpg,,"Les aventures de Télémaque, fils d'Ulysse",1,0
"[Scènes de l'enfance du Christ]",,,,,,,,,,Vignettes,latin,"Gravure sur bois",PAT_16M_022_301_web,,,,,,,,,,,,,,,,,,,,,,,,,,,,,,,,,,,,"Adoration des Mages,Âne,Ange,Angelot,Arbre,Assis,Bâton,Boeuf,Christ,Enfance du Christ,Enfant Jésus,Étable,Étoile,Évangile selon saint Matthieu,Fuite,Fuite en Égypte,Les Mages,Nativité,Offrande,Saint Joseph,Transport à dos d'animal,Vierge,Voyage",https://hieronyma.ict-toulouse.fr/files/original/c7e102be6ecfa3538deb36f56bd8d856.jpg,,"[Bible, latin, 1574]",1,0
"Ordre de la marche des Israelites dans le desert",,,,,,,,,,"Image mi-page","français ; latin","Gravure sur cuivre",PAT_18G_001_075_web_a,,,,,,,,,,,,,,,,,,,,,,,,,,,,,,,,,,,,"Colonne,Désert,Dieu le Père,Fumée,Livre de l'Exode,Livre des Nombres,Voyage",https://hieronyma.ict-toulouse.fr/files/original/e020af91ded759e112d2c859458f202b.JPG,,"L'Ancien et le Nouveau Testament représentés en cinq cens tableaux gravés d'après les desseins de Raphaël & autres grands maîtres et expliqués par les paroles de l'Ecriture",1,0
"Ruth s'attache a Noemi sa belle mere et la suit",,,,,,,,,,"Image mi-page","français ; latin","Gravure sur cuivre",PAT_18G_001_097_web_b,,,,,,,,,,,,,,,,,,,,,,,,,,,,,,,,,,,,"Famille,Livre de Ruth,Noémi,Ruth,Séparation,Voyage",https://hieronyma.ict-toulouse.fr/files/original/4a678ad178eb62052b6891cda60b482e.JPG,,"L'Ancien et le Nouveau Testament représentés en cinq cens tableaux gravés d'après les desseins de Raphaël & autres grands maîtres et expliqués par les paroles de l'Ecriture",1,0
"La fuite en Egypte.",,,,,,,,,,"Image mi-page","français ; latin","Gravure sur cuivre",PAT_18G_001_173b,,,,,,,,,,,,,,,,,,,,,,,,,,,,,,,,,,,,"Âne,Enfance du Christ,Enfant Jésus,Évangile selon saint Matthieu,Fuite en Égypte,Saint Joseph,Sainte Famille,Statue,Vierge,Voyage,Voyageur",https://hieronyma.ict-toulouse.fr/files/original/e845689089f70dee5c433a59aac7cdee.JPG,,"L'Ancien et le Nouveau Testament représentés en cinq cens tableaux gravés d'après les desseins de Raphaël & autres grands maîtres et expliqués par les paroles de l'Ecriture",1,0
"La s.te famille revient d'Egypte",,,,,,,,,,"Image mi-page","français ; latin","Gravure sur cuivre",PAT_18G_001_174b,,,,,,,,,,,,,,,,,,,,,,,,,,,,,,,,,,,,"Âne,Ange,Enfance du Christ,Enfant Jésus,Évangile selon saint Matthieu,Palmier,Retour d'Égypte,Saint Joseph,Sainte Famille,Vierge,Voyage,Voyageur",https://hieronyma.ict-toulouse.fr/files/original/a8cfb172ab8b635443d9753b6d5e65cb.JPG,,"L'Ancien et le Nouveau Testament représentés en cinq cens tableaux gravés d'après les desseins de Raphaël & autres grands maîtres et expliqués par les paroles de l'Ecriture",1,0
"Maniere de porter le S. Sacrement quand le Pape est en Vojage.",,,"Picart, Bernard, 1673-1733, Illustrateur",,,,,,,"Image mi-page",français,"Gravure sur cuivre",PAT_18G_002_009_web,,,,,,,,,,,,,,,,,,,,,,,,,,,,,,,,,,,,"Catholicisme,Cavalier,Cortège,Crucifix,Eucharistie,Mobilier religieux,Pape,Pratique religieuse,Transport à dos d'animal,Voyage,Voyageur",https://hieronyma.ict-toulouse.fr/files/original/2be2cb95935bdcc1ce052c519a9b485a.jpg,,"Ceremonies et coutumes religieuses de tous les peuples du monde..., 2",1,0
