﻿"Dublin Core:Title","Dublin Core:Subject","Dublin Core:Description","Dublin Core:Creator","Dublin Core:Source","Dublin Core:Publisher","Dublin Core:Date","Dublin Core:Contributor","Dublin Core:Rights","Dublin Core:Relation","Dublin Core:Format","Dublin Core:Language","Dublin Core:Type","Dublin Core:Identifier","Dublin Core:Coverage","Item Type Metadata:Text","Item Type Metadata:Interviewer","Item Type Metadata:Interviewee","Item Type Metadata:Location","Item Type Metadata:Transcription","Item Type Metadata:Local URL","Item Type Metadata:Original Format","Item Type Metadata:Physical Dimensions","Item Type Metadata:Duration","Item Type Metadata:Compression","Item Type Metadata:Producer","Item Type Metadata:Director","Item Type Metadata:Bit Rate/Frequency","Item Type Metadata:Time Summary","Item Type Metadata:Email Body","Item Type Metadata:Subject Line","Item Type Metadata:From","Item Type Metadata:To","Item Type Metadata:CC","Item Type Metadata:BCC","Item Type Metadata:Number of Attachments","Item Type Metadata:Standards","Item Type Metadata:Objectives","Item Type Metadata:Materials","Item Type Metadata:Lesson Plan Text","Item Type Metadata:URL","Item Type Metadata:Event Type","Item Type Metadata:Participants","Item Type Metadata:Birth Date","Item Type Metadata:Birthplace","Item Type Metadata:Death Date","Item Type Metadata:Occupation","Item Type Metadata:Biographical Text","Item Type Metadata:Bibliography",tags,file,itemType,collection,public,featured
"Livre X : Mentor sort de Salante pour proposer la paix aux ennemis, qui venoient assiéger la ville.",,,,,,,,,,Planche,français,"Gravure sur cuivre",FD_487-1_013_web,,,,,,,,,,,,,,,,,,,,,,,,,,,,,,,,,,,,"Armée,Branche,La paix,Mentor,Olivier,Rempart,Ville",https://hieronyma.ict-toulouse.fr/files/original/6c31d67abc9e9494c48e71e63720fe1b.jpg,,"Les aventures de Télémaque, fils d'Ulysse",1,0
"L'ange montre Jérusalem à saint Jean.",,,,,,,,,,Planche,,"Gravure sur acier",1133_SAI_2_110_web,,,,,,,,,,,,,,,,,,,,,,,,,,,,,,,,,,,,"Ange,Apocalypse,Jérusalem céleste,Rayons lumineux,Saint Jean,Ville",https://hieronyma.ict-toulouse.fr/files/original/bd4a7c1a75f40a714fc9629e5d76ac70.JPG,,"La Sainte Bible : traduction nouvelle selon la Vulgate",1,1
"Le prophète Amos",,,,,,,,,,Planche,,"Gravure sur acier",1133_SAI_2_017_web,,,,,,,,,,,,,,,,,,,,,,,,,,,,,,,,,,,,"Amos,Livre d'Amos,Petit Prophète,Ville",https://hieronyma.ict-toulouse.fr/files/original/41306e8c795c315d4f5d7e67271219fa.JPG,,"La Sainte Bible : traduction nouvelle selon la Vulgate",1,0
L'Enfer,,,,,,,,,,"Image pleine page",,"Gravure sur cuivre",PAT_17P_618_021_web,,,,,,,,,,,,,,,,,,,,,,,,,,,,,,,,,,,,"Assis,Cadavre,Diable,Diablotin,Enfer,Flamme,Léviathan,Mer,Mer Rouge,Moïse,Noyade,Puits,Roi,Satan,Serpent,Tente,Ville",https://hieronyma.ict-toulouse.fr/files/original/f398447a896c2bd0d32d9991032f0819.jpg,"Image fixe","Catechisme Royal",1,0
"[Le Jugement]",,,,,,,,,,"Image pleine page",,"Gravure sur cuivre",PAT_17P_618_020_web,,,,,,,,,,,,,,,,,,,,,,,,,,,,,,,,,,,,"Ange,Arche de Noé,Armée,Assis,Cadavre,Christ juge,Damné,Dauphin,Élu,Épée,Femme,Foudre,Inondation,Jugement,Jugement dernier,Nourrisson,Noyade,Nuée,Résurrection des morts,Roi,Salomon,Soldat,Statue,Tente,Trône,Ville",https://hieronyma.ict-toulouse.fr/files/original/a3f16ac1511502ce3f5c4b6fb706f7b6.jpg,"Image fixe","Catechisme Royal",1,0
"Les IV. fins dernieres.",,,,,,,,,,"Image pleine page",,"Gravure sur cuivre",PAT_17P_618_013_web,,,,,,,,,,,,,,,,,,,,,,,,,,,,,,,,,,,,"Adam,Bateau à voiles,Chérubin,Christ glorieux,Coré,Enfer,Ève,Famille,Flamme,Incendie,Jugement dernier,Mammifère marin,Médiation,Nuée,Paradis terrestre,Punition,Rayons lumineux,Résurrection des morts,Saint,Souffle,Squelette,Ville",https://hieronyma.ict-toulouse.fr/files/original/933b928af2634b6a15eb13b9992916a8.JPG,"Image fixe","Catechisme Royal",1,0
"[Début du Livre d'Aggée : Portrait d'Aggée]",,,,,,,,,,Vignette,,"Gravure sur bois",PAT_16M_022_289_web,,,,,,,,,,,,,,,,,,,,,,,,,,,,,,,,,,,,"Aggée,Assis,Livre d'Aggée,Petit Prophète,Phylactère,Rocher,Ville",https://hieronyma.ict-toulouse.fr/files/original/4c1bba4f53241775a0118b9c74b5dc9c.JPG,"Image fixe","[Bible, latin, 1574]",1,0
"[Début du Livre de Nahum : Portrait de Nahum]",,,,,,,,,,Vignette,,"Gravure sur bois",PAT_16M_022_284_web,,,,,,,,,,,,,,,,,,,,,,,,,,,,,,,,,,,,"Livre de Nahum,Nahum,Petit Prophète,Prière,Ville",https://hieronyma.ict-toulouse.fr/files/original/e36030a270333e0f3d4865348d0e0a7a.JPG,"Image fixe","[Bible, latin, 1574]",1,0
"[Jonas est rejeté par la baleine. Jonas annonce la destruction de Ninive]",,,,,,,,,,Vignette,,"Gravure sur bois",PAT_16M_022_280_web,,,,,,,,,,,,,,,,,,,,,,,,,,,,,,,,,,,,"Baleine,Bateau à voiles,Bord de mer,Jonas,Livre de Jonas,Mer,Ninive,Nudité,Pénitence,Petit Prophète,Sacrifice,Tempête,Ville",https://hieronyma.ict-toulouse.fr/files/original/55854a6460421dca59c2d71d56ea67d2.JPG,"Image fixe","[Bible, latin, 1574]",1,0
"[Début du Livre d'Osée : Portrait d'Osée]",,,,,,,,,,Vignette,,"Gravure sur bois",PAT_16M_022_273_web,,,,,,,,,,,,,,,,,,,,,,,,,,,,,,,,,,,,"Arbre,Livre d'Osée,Oiseau,Osée,Petit Prophète,Prière,Ville",https://hieronyma.ict-toulouse.fr/files/original/7b08af9bcb77018a52fce0b64a9759aa.JPG,"Image fixe","[Bible, latin, 1574]",1,0
