﻿"Dublin Core:Title","Dublin Core:Subject","Dublin Core:Description","Dublin Core:Creator","Dublin Core:Source","Dublin Core:Publisher","Dublin Core:Date","Dublin Core:Contributor","Dublin Core:Rights","Dublin Core:Relation","Dublin Core:Format","Dublin Core:Language","Dublin Core:Type","Dublin Core:Identifier","Dublin Core:Coverage","Item Type Metadata:Text","Item Type Metadata:Interviewer","Item Type Metadata:Interviewee","Item Type Metadata:Location","Item Type Metadata:Transcription","Item Type Metadata:Local URL","Item Type Metadata:Original Format","Item Type Metadata:Physical Dimensions","Item Type Metadata:Duration","Item Type Metadata:Compression","Item Type Metadata:Producer","Item Type Metadata:Director","Item Type Metadata:Bit Rate/Frequency","Item Type Metadata:Time Summary","Item Type Metadata:Email Body","Item Type Metadata:Subject Line","Item Type Metadata:From","Item Type Metadata:To","Item Type Metadata:CC","Item Type Metadata:BCC","Item Type Metadata:Number of Attachments","Item Type Metadata:Standards","Item Type Metadata:Objectives","Item Type Metadata:Materials","Item Type Metadata:Lesson Plan Text","Item Type Metadata:URL","Item Type Metadata:Event Type","Item Type Metadata:Participants","Item Type Metadata:Birth Date","Item Type Metadata:Birthplace","Item Type Metadata:Death Date","Item Type Metadata:Occupation","Item Type Metadata:Biographical Text","Item Type Metadata:Bibliography",tags,file,itemType,collection,public,featured
"Une main écrit la condamnation de Balthasar au milieu d'un festin.",,,,,,,,,,"Image mi-page","français ; latin","Gravure sur cuivre",PAT_18G_001_146b,,,,,,,,,,,,,,,,,,,,,,,,,,,,,,,,,,,,"Apparition,Balthazar,Banquet,Écriture,Livre de Daniel,Main,Mur,Musicien,Palais,Peur,Prodige,Repas,Roi,Vase",https://hieronyma.ict-toulouse.fr/files/original/dbd3a3071c6aecffb870682d55def1aa.JPG,,"L'Ancien et le Nouveau Testament représentés en cinq cens tableaux gravés d'après les desseins de Raphaël & autres grands maîtres et expliqués par les paroles de l'Ecriture",1,0
"Travail de l'autel et des vases du Temple.",,,,,,,,,,"Image mi-page","français ; latin","Gravure sur cuivre",PAT_18G_001_119b,,,,,,,,,,,,,,,,,,,,,,,,,,,,,,,,,,,,"Autel,Chantier,Le Temple,Mobilier biblique,Orfèvrerie,Premier Livre des Rois,Vase",https://hieronyma.ict-toulouse.fr/files/original/7283ffaef267090b6983e8ab4fa2b221.JPG,,"L'Ancien et le Nouveau Testament représentés en cinq cens tableaux gravés d'après les desseins de Raphaël & autres grands maîtres et expliqués par les paroles de l'Ecriture",1,0
"On travaille a l'autel des holocaustes et a la cuve.",,,,,,,,,,"Image mi-page","français ; latin","Gravure sur cuivre",PAT_18G_001_066_web_b,,,,,,,,,,,,,,,,,,,,,,,,,,,,,,,,,,,,"Autel,Chantier,Livre de l'Exode,Menuiserie,Orfèvrerie,Vase",https://hieronyma.ict-toulouse.fr/files/original/4f4dda592a691aa23a8816b74e07d285.JPG,,"L'Ancien et le Nouveau Testament représentés en cinq cens tableaux gravés d'après les desseins de Raphaël & autres grands maîtres et expliqués par les paroles de l'Ecriture",1,0
"Les Freres de Joseph lui offrent des Présents",,,,,,,,,,"Image mi-page","français ; latin","Gravure sur cuivre",PAT_18G_001_044_web_a,,,,,,,,,,,,,,,,,,,,,,,,,,,,,,,,,,,,"Don,Famille,Intérieur,Joseph,Livre de la Genèse,Palais,Vase",https://hieronyma.ict-toulouse.fr/files/original/13df2ebcc5f755c922e0d9a3800d3e57.JPG,,"L'Ancien et le Nouveau Testament représentés en cinq cens tableaux gravés d'après les desseins de Raphaël & autres grands maîtres et expliqués par les paroles de l'Ecriture",1,0
"Judas fait purifier le temple et retablit le service divin.",,,,,,,,,,"Image mi-page","français ; latin","Gravure sur cuivre",PAT_18G_001_160b,,,,,,,,,,,,,,,,,,,,,,,,,,,,,,,,,,,,"Autel,Construction,Judas Maccabée,Le Temple,Maçonnerie,Mobilier biblique,Orfèvrerie,Premier Livre des Maccabées,Rite de purification,Vase",https://hieronyma.ict-toulouse.fr/files/original/2f208c7dc88c0d26c2647ab92a08ba8b.JPG,,"L'Ancien et le Nouveau Testament représentés en cinq cens tableaux gravés d'après les desseins de Raphaël & autres grands maîtres et expliqués par les paroles de l'Ecriture",1,0
"Jesus instruit la Samaritaine",,,,,,,,,,"Image mi-page","français ; latin","Gravure sur cuivre",PAT_18G_001_179b,,,,,,,,,,,,,,,,,,,,,,,,,,,,,,,,,,,,"Christ,Discussion,Évangile selon saint Jean,Femme,La Samaritaine au puits,Porte de ville,Puits,Vase",https://hieronyma.ict-toulouse.fr/files/original/558e4bd0fd85f1255e0351b2e532aa90.JPG,,"L'Ancien et le Nouveau Testament représentés en cinq cens tableaux gravés d'après les desseins de Raphaël & autres grands maîtres et expliqués par les paroles de l'Ecriture",1,0
"Jésus et la Samaritaine.",,,,,,,,,,Planche,,"Gravure sur acier",1133_SAI_2_044_web,,,,,,,,,,,,,,,,,,,,,,,,,,,,,,,,,,,,"Christ,Discussion,Évangile selon saint Jean,Femme,La Samaritaine au puits,Puits,Vase",https://hieronyma.ict-toulouse.fr/files/original/227bdfd4790ad598b852a5459e03fb82.JPG,,"La Sainte Bible : traduction nouvelle selon la Vulgate",1,1
"Jesus cha[n]ge l'eau en vin aux nopces de Cana.",,,,,,,,,,"Image mi-page","français ; latin","Gravure sur cuivre",PAT_18G_001_178a,,,,,,,,,,,,,,,,,,,,,,,,,,,,,,,,,,,,"Banquet,Christ,Évangile selon saint Jean,Miracle,Miracle du Christ,Noces de Cana,Vase,Vierge,Vin",https://hieronyma.ict-toulouse.fr/files/original/f86bdf4941bd28978044154da579be55.JPG,,"L'Ancien et le Nouveau Testament représentés en cinq cens tableaux gravés d'après les desseins de Raphaël & autres grands maîtres et expliqués par les paroles de l'Ecriture",1,0
"Holocauste d'Elie consumé par le feu du ciel.",,,,,,,,,,"Image mi-page","français ; latin","Gravure sur cuivre",PAT_18G_001_126b,,,,,,,,,,,,,,,,,,,,,,,,,,,,,,,,,,,,"Achab,Autel,Eau,Élie,Feu,Premier Livre des Rois,Prophète,Sacrifice,Vase",https://hieronyma.ict-toulouse.fr/files/original/97f62567fd52a20147f13e5f23f9a128.JPG,,"L'Ancien et le Nouveau Testament représentés en cinq cens tableaux gravés d'après les desseins de Raphaël & autres grands maîtres et expliqués par les paroles de l'Ecriture",1,0
"Gedeon attaque de nuit les Madianites et les défait.",,,,,,,,,,"Image mi-page","français ; latin","Gravure sur cuivre",PAT_18G_001_089_web_b,,,,,,,,,,,,,,,,,,,,,,,,,,,,,,,,,,,,"Bataille,Gédéon,Livre des Juges,Nuit,Torche,Vase,Victoire",https://hieronyma.ict-toulouse.fr/files/original/df4cb0b784f6b2e95f963de0d7ccca12.JPG,,"L'Ancien et le Nouveau Testament représentés en cinq cens tableaux gravés d'après les desseins de Raphaël & autres grands maîtres et expliqués par les paroles de l'Ecriture",1,0
