﻿"Dublin Core:Title","Dublin Core:Subject","Dublin Core:Description","Dublin Core:Creator","Dublin Core:Source","Dublin Core:Publisher","Dublin Core:Date","Dublin Core:Contributor","Dublin Core:Rights","Dublin Core:Relation","Dublin Core:Format","Dublin Core:Language","Dublin Core:Type","Dublin Core:Identifier","Dublin Core:Coverage","Item Type Metadata:Text","Item Type Metadata:Interviewer","Item Type Metadata:Interviewee","Item Type Metadata:Location","Item Type Metadata:Transcription","Item Type Metadata:Local URL","Item Type Metadata:Original Format","Item Type Metadata:Physical Dimensions","Item Type Metadata:Duration","Item Type Metadata:Compression","Item Type Metadata:Producer","Item Type Metadata:Director","Item Type Metadata:Bit Rate/Frequency","Item Type Metadata:Time Summary","Item Type Metadata:Email Body","Item Type Metadata:Subject Line","Item Type Metadata:From","Item Type Metadata:To","Item Type Metadata:CC","Item Type Metadata:BCC","Item Type Metadata:Number of Attachments","Item Type Metadata:Standards","Item Type Metadata:Objectives","Item Type Metadata:Materials","Item Type Metadata:Lesson Plan Text","Item Type Metadata:URL","Item Type Metadata:Event Type","Item Type Metadata:Participants","Item Type Metadata:Birth Date","Item Type Metadata:Birthplace","Item Type Metadata:Death Date","Item Type Metadata:Occupation","Item Type Metadata:Biographical Text","Item Type Metadata:Bibliography",tags,file,itemType,collection,public,featured
"[Parabole des vignerons homicides. Jésus annonce la destruction du Temple]",,,,,,,,,,Vignettes,latin,"Gravure sur bois",PAT_16M_022_380_web,,,,,,,,,,,,,,,,,,,,,,,,,,,,,,,,,,,,"Désigner,Évangile selon saint Luc,Ferme,Le Temple,Les Apôtres,Les vignerons homicides,Meurtre,Parabole,Serviteur,Tour,Vigneron",https://hieronyma.ict-toulouse.fr/files/original/6688775485c129a6c241759969061016.jpg,,"[Bible, latin, 1574]",1,0
"[Parabole des vignerons homicides. Le Christ enseignant]",,,,,,,,,,Vignettes,latin,"Gravure sur bois",PAT_16M_022_346_web,,,,,,,,,,,,,,,,,,,,,,,,,,,,,,,,,,,,"Christ,Christ enseignant,Évangile selon saint Marc,Ferme,Les vignerons homicides,Meurtre,Parabole,Serviteur,Tour,Vigneron",https://hieronyma.ict-toulouse.fr/files/original/0a39a4a6f6bb937e2cc2acfb256024cc.jpg,,"[Bible, latin, 1574]",1,0
"[Parabole des vignerons homicides]",,,,,,,,,,Vignette,latin,"Gravure sur bois",PAT_16M_022_321_web,,,,,,,,,,,,,,,,,,,,,,,,,,,,,,,,,,,,"Évangile selon saint Matthieu,Ferme,Les vignerons homicides,Meurtre,Parabole,Serviteur,Tour,Vigneron",https://hieronyma.ict-toulouse.fr/files/original/3d8221474e019df7774679e9fe84e861.jpg,,"[Bible, latin, 1574]",1,0
"[Tour de cornes]",,,,,,,,,,Planche,,"Gravure sur cuivre",PAT_18P_280-8_009_web,,,,,,,,,,,,,,,,,,,,,,,,,,,,,,,,,,,,"Animal,Iran,Ispahan,Tête,Tour",https://hieronyma.ict-toulouse.fr/files/original/3c550671dc85a8ab981291958cde6f0a.JPG,"Image fixe","Voyages de Mr. Le Chevalier Chardin, en Perse, et autres lieux de l'Orient. Tome Huitième",1,0
"Abimelech tué par une femme au siège de Thebés.",,,,,,,,,,"Image mi-page","français ; latin","Gravure sur cuivre",PAT_18G_001_090_web_b,,,,,,,,,,,,,,,,,,,,,,,,,,,,,,,,,,,,"Abimélek (Juge d'Israël),Femme,Guerre de siège,Livre des Juges,Meule,Mort,Soldat,Tour",https://hieronyma.ict-toulouse.fr/files/original/03959e229c43b2896a454b5aec684fd0.JPG,,"L'Ancien et le Nouveau Testament représentés en cinq cens tableaux gravés d'après les desseins de Raphaël & autres grands maîtres et expliqués par les paroles de l'Ecriture",1,0
"Les festes du mois de decembre : Ste Barbe, La Conception de la V. Marie, S. Nicolas, St Jean l'Evangeliste, La Nativité de N. Seigneur, St Estienne mart., St Lazare, Les Sts Innocens, St Thomas Apostre",,,,,,,,,,"Image pleine page",français,"Gravure sur cuivre",PAT_17G_193_021_web,,,,,,,,,,,,,,,,,,,,,,,,,,,,,,,,,,,,"Aigle de saint Jean,Âne,Auréole,Bassin,Berger,Boeuf,Coupe (récipient),Crosse,Dieu le Père,Dragon,Enfance du Christ,Enfant,Enfant Jésus,Étable,Évêque,Famille,Femme,Instrument scientifique,Lance,Lune,Massacre des Innocents,Meurtre,Mitre,Mort par le fer,Nativité,Nuée,Palme,Pierre,Rayons lumineux,Saint Étienne,Saint Jean,Saint Joseph,Saint Lazare,Saint Nicolas de Myre,Saint Thomas,Sainte Barbe,Serpent,Soldat,Soleil,Tour,Vierge",https://hieronyma.ict-toulouse.fr/files/original/c94eab29a81a4fc3d180c20d69bcbe6d.jpg,,"Les Fleurs des Vies des saints... [1678]",1,0
"Livre V. Planche III : [Exercices de mesure]",,,,,,,,,,Planche,,"Gravure sur cuivre",PAT_18M_049_025_web,,,,,,,,,,,,,,,,,,,,,,,,,,,,,,,,,,,,"Carte,Cours d'eau,Dessin scientifique,Figure géométrique,Géométrie,Tour",https://hieronyma.ict-toulouse.fr/files/original/3864f340dc517c9dd18abf38c5902f04.JPG,"Image fixe","Geometrie élémentaire et pratique",1,0
"Livre V. Planche VIII : [Mesure de l'altitude et des distances sur mer]",,,,,,,,,,Planche,,"Gravure sur cuivre",PAT_18M_049_030_web,,,,,,,,,,,,,,,,,,,,,,,,,,,,,,,,,,,,"Bateau à voiles,Figure géométrique,Géométrie,Mer,Montagne,Tour",https://hieronyma.ict-toulouse.fr/files/original/de062de43204a520c564d3c6ba23c952.JPG,"Image fixe","Geometrie élémentaire et pratique",1,0
"XVIII. personnes ecrasées par la tour de Siloe",,,,,,,,,,"Image mi-page","français ; latin","Gravure sur cuivre",PAT_18G_001_199a,,,,,,,,,,,,,,,,,,,,,,,,,,,,,,,,,,,,"Bassin d'eau,Chute,Destruction,Évangile selon saint Luc,Jérusalem,Mort,Tour",https://hieronyma.ict-toulouse.fr/files/original/3d4e64ecb9755c87d19fea5b6039fd1a.JPG,,"L'Ancien et le Nouveau Testament représentés en cinq cens tableaux gravés d'après les desseins de Raphaël & autres grands maîtres et expliqués par les paroles de l'Ecriture",1,0
