﻿"Dublin Core:Title","Dublin Core:Subject","Dublin Core:Description","Dublin Core:Creator","Dublin Core:Source","Dublin Core:Publisher","Dublin Core:Date","Dublin Core:Contributor","Dublin Core:Rights","Dublin Core:Relation","Dublin Core:Format","Dublin Core:Language","Dublin Core:Type","Dublin Core:Identifier","Dublin Core:Coverage","Item Type Metadata:Text","Item Type Metadata:Interviewer","Item Type Metadata:Interviewee","Item Type Metadata:Location","Item Type Metadata:Transcription","Item Type Metadata:Local URL","Item Type Metadata:Original Format","Item Type Metadata:Physical Dimensions","Item Type Metadata:Duration","Item Type Metadata:Compression","Item Type Metadata:Producer","Item Type Metadata:Director","Item Type Metadata:Bit Rate/Frequency","Item Type Metadata:Time Summary","Item Type Metadata:Email Body","Item Type Metadata:Subject Line","Item Type Metadata:From","Item Type Metadata:To","Item Type Metadata:CC","Item Type Metadata:BCC","Item Type Metadata:Number of Attachments","Item Type Metadata:Standards","Item Type Metadata:Objectives","Item Type Metadata:Materials","Item Type Metadata:Lesson Plan Text","Item Type Metadata:URL","Item Type Metadata:Event Type","Item Type Metadata:Participants","Item Type Metadata:Birth Date","Item Type Metadata:Birthplace","Item Type Metadata:Death Date","Item Type Metadata:Occupation","Item Type Metadata:Biographical Text","Item Type Metadata:Bibliography",tags,file,itemType,collection,public,featured
"Au Dimanche de la Resurrection.",,,,,,,,,,"Image pleine page",,"Gravure sur cuivre",CAP_17P_338_005_web,,,,,,,,,,,,,,,,,,,,,,,,,,,,,,,,,,,,"Christ,Croix,Étendard,Gloire,La Résurrection,Nouveau Testament,Peur,Rayons lumineux,Résurrection du Christ,Soldat,Sommeil,Tombeau",https://hieronyma.ict-toulouse.fr/files/original/2a10268613138d6c3ddd297ab2d1ccc4.jpg,"Image fixe","L'office de la semaine saincte, selon le messel & Breviaire Romain.",1,0
"Abraham ensevelit Sara.",,,,,,,,,,Planche,,"Gravure sur acier",1133_SAI_1_017_web,,,,,,,,,,,,,,,,,,,,,,,,,,,,,,,,,,,,"Abraham,Cadavre,Livre de la Genèse,Sara,Tombeau",https://hieronyma.ict-toulouse.fr/files/original/f860bd133302d482fe97e81c011fe306.JPG,"Image fixe","La Sainte Bible : traduction nouvelle selon la Vulgate",1,0
"[Un mort ressuscite après avoir été mis dans la tombe d'Élisée]",,,,,,,,,,Vignette,,"Gravure sur bois",PAT_16M_022_216_web,,,,,,,,,,,,,,,,,,,,,,,,,,,,,,,,,,,,"Cadavre,Deuxième Livre des Rois,Élisée,Homme,Résurrection,Tombeau",https://hieronyma.ict-toulouse.fr/files/original/2a94df8954100ab559e43317bcdfcf82.jpg,"Image fixe","[Bible, latin, 1574]",1,0
"[Tombeaux de Naqš-e Rostam]",,,,,,,,,,Planche,français,"Gravure sur cuivre",PAT_18P_280-9_025_web,,,,,,,,,,,,,,,,,,,,,,,,,,,,,,,,,,,,"Iran,Montagne,Naqš-e Rostam (Iran, site archéologique),Ruines,Tombeau",https://hieronyma.ict-toulouse.fr/files/original/6993275ce2165195de12fddeee511ae5.jpg,,"Voyages de Mr. Le Chevalier Chardin, en Perse, et autres lieux de l'Orient. Tome Neuvième",1,0
"[Suicide d'Achitophel]",,,,,,,,,,"Pleine page",,"Gravure sur bois",PAT_16M_022_181_web,,,,,,,,,,,,,,,,,,,,,,,,,,,,,,,,,,,,"Achitophel,Deuxième livre de Samuel,Pendaison,Suicide,Tombeau",https://hieronyma.ict-toulouse.fr/files/original/057f4972649b70e5b2958d659edcf729.jpg,"Image fixe","[Bible, latin, 1574]",1,0
"[Scènes de la Résurrection]",,,,,,,,,,Vignettes,latin,"Gravure sur bois",PAT_16M_022_353_web,,,,,,,,,,,,,,,,,,,,,,,,,,,,,,,,,,,,"Ange,Apparition,Apparition à Madeleine,Apparition du Christ,Ascension,Bâton,Christ,Emmaüs,Évangile selon saint Marc,Jardinier,La Résurrection,Les Apôtres,Les Saintes Femmes,Les Saintes Femmes au tombeau,Pèlerin,Pèlerins d'Emmaüs,Rayons lumineux,Sainte Madeleine,Tombeau",https://hieronyma.ict-toulouse.fr/files/original/6851f1b74b08fae5b8d3fcec89363164.jpg,,"[Bible, latin, 1574]",1,0
"[Scènes de la Passion]",,,,,,,,,,Vignettes,latin,"Gravure sur bois",PAT_16M_022_385_web,,,,,,,,,,,,,,,,,,,,,,,,,,,,,,,,,,,,"Christ,Christ mort,Crucifixion,Descente de Croix,Évangile selon saint Luc,La Croix,Le coup de lance,Les instruments de la Passion,Les larrons,Les Saintes Femmes,Mise au tombeau,Pâmoison de la Vierge,Passion,Présentation du vinaigre,Saint Jean,Soldat,Tombeau,Vierge",https://hieronyma.ict-toulouse.fr/files/original/14a925ce73331b7a47f6ec3a8cb62e0f.jpg,,"[Bible, latin, 1574]",1,0
"[Scènes de la Passion]",,,,,,,,,,Vignettes,latin,"Gravure sur bois",PAT_16M_022_330_web,,,,,,,,,,,,,,,,,,,,,,,,,,,,,,,,,,,,"Christ,Christ mort,Crucifixion,Descente de Croix,Échelle,Évangile selon saint Matthieu,La Croix,Le coup de lance,Le Crucifiement,Les instruments de la Passion,Les larrons,Les Saintes Femmes,Mise au tombeau,Pâmoison de la Vierge,Passion,Présentation du vinaigre,Saint Jean,Soldat,Tombeau",https://hieronyma.ict-toulouse.fr/files/original/edbcbdb30ed2e7ca9f5cdf12bcf8f804.jpg,,"[Bible, latin, 1574]",1,0
"[Scène de la Résurrection]",,,,,,,,,,Vignettes,latin,"Gravure sur bois",PAT_16M_022_331_web,,,,,,,,,,,,,,,,,,,,,,,,,,,,,,,,,,,,"Ange,Apparition,Apparition à Madeleine,Christ,Étendard,Évangile selon saint Matthieu,Jardinier,Les Saintes Femmes,Les Saintes Femmes au tombeau,Rayons lumineux,Résurrection du Christ,Sainte Madeleine,Soldat,Sommeil,Tombeau",https://hieronyma.ict-toulouse.fr/files/original/4c25ae5671dfedf6fe490a3f8e6b8851.jpg,,"[Bible, latin, 1574]",1,0
"[Plat supérieur (détail) : La Résurrection]",,,,,,,,,,Reliure,,"Peau de truie estampée à froid",RES_16G_020_005_web,,,,,,,,,,,,,,,,,,,,,,,,,,,,,,,,,,,,"Christ,Étendard,La Résurrection,Nouveau Testament,Résurrection du Christ,Robert Estienne,Tombeau",https://hieronyma.ict-toulouse.fr/files/original/b84ebba654137272a90151e5ed330234.JPG,"Image fixe","[Bible, N.T., grec ancien, 1550]",1,0
