﻿"Dublin Core:Title","Dublin Core:Subject","Dublin Core:Description","Dublin Core:Creator","Dublin Core:Source","Dublin Core:Publisher","Dublin Core:Date","Dublin Core:Contributor","Dublin Core:Rights","Dublin Core:Relation","Dublin Core:Format","Dublin Core:Language","Dublin Core:Type","Dublin Core:Identifier","Dublin Core:Coverage","Item Type Metadata:Text","Item Type Metadata:Interviewer","Item Type Metadata:Interviewee","Item Type Metadata:Location","Item Type Metadata:Transcription","Item Type Metadata:Local URL","Item Type Metadata:Original Format","Item Type Metadata:Physical Dimensions","Item Type Metadata:Duration","Item Type Metadata:Compression","Item Type Metadata:Producer","Item Type Metadata:Director","Item Type Metadata:Bit Rate/Frequency","Item Type Metadata:Time Summary","Item Type Metadata:Email Body","Item Type Metadata:Subject Line","Item Type Metadata:From","Item Type Metadata:To","Item Type Metadata:CC","Item Type Metadata:BCC","Item Type Metadata:Number of Attachments","Item Type Metadata:Standards","Item Type Metadata:Objectives","Item Type Metadata:Materials","Item Type Metadata:Lesson Plan Text","Item Type Metadata:URL","Item Type Metadata:Event Type","Item Type Metadata:Participants","Item Type Metadata:Birth Date","Item Type Metadata:Birthplace","Item Type Metadata:Death Date","Item Type Metadata:Occupation","Item Type Metadata:Biographical Text","Item Type Metadata:Bibliography",tags,file,itemType,collection,public,featured
[Temple],,,,,,,,,,"Image mi-page",,"Gravure sur bois",RES_17P_002_040_web,,,,,,,,,,,,,,,,,,,,,,,,,,,,,,,,,,,,"Italie,Rome,Ruines,Temple",https://hieronyma.ict-toulouse.fr/files/original/c8e8235b1e22c47d9975594f7f309ec3.jpg,"Image fixe","Les Merveilles de la ville de Rome",1,0
"[Vestiges du Temple de la Paix]",,,,,,,,,,"Image mi-page",,"Gravure sur bois",RES_17P_002_043_web,,,,,,,,,,,,,,,,,,,,,,,,,,,,,,,,,,,,"Italie,Rome,Ruines,Temple",https://hieronyma.ict-toulouse.fr/files/original/a8658a2d1cb645e107cb163dc35de58c.jpg,"Image fixe","Les Merveilles de la ville de Rome",1,0
Andromaque.,,,,,,,,,,Planche,,"Gravure sur cuivre",PAT_18M_032-1_006_web,,,,,,,,,,,,,,,,,,,,,,,,,,,,,,,,,,,,"Andromaque,Autel,Intérieur,JEP2019,Mariage,Meurtre,Mort par le fer,Oreste,Pyrrhus,Temple",https://hieronyma.ict-toulouse.fr/files/original/f389467d6cfecc1dcda9fe5421f75f7b.jpg,"Image fixe","Oeuvres complètes de Jean Racine 1",1,1
"Bel et son Temple Détruit par Daniel",,,,,,,,,,"Image mi-page","français ; latin","Gravure sur cuivre",PAT_18G_001_151b,,,,,,,,,,,,,,,,,,,,,,,,,,,,,,,,,,,,"Daniel,Destruction,Grand prophète,Idole,Intérieur,Livre de Daniel,Roi,Temple",https://hieronyma.ict-toulouse.fr/files/original/05700a134dbfe63b546c332f6d5d138d.JPG,,"L'Ancien et le Nouveau Testament représentés en cinq cens tableaux gravés d'après les desseins de Raphaël & autres grands maîtres et expliqués par les paroles de l'Ecriture",1,0
"Dagon tombe et se brise devant l'arche.",,,,,,,,,,"Image mi-page","français ; latin","Gravure sur cuivre",PAT_18G_001_100_web_a,,,,,,,,,,,,,,,,,,,,,,,,,,,,,,,,,,,,"Destruction,Idole,L'arche d'alliance,Premier Livre de Samuel,Prêtre,Statue,Temple",https://hieronyma.ict-toulouse.fr/files/original/266a71daeb63bc7d51a80f546cc4d13e.JPG,,"L'Ancien et le Nouveau Testament représentés en cinq cens tableaux gravés d'après les desseins de Raphaël & autres grands maîtres et expliqués par les paroles de l'Ecriture",1,0
"Daniel confond les prêtres de Baal.",,,,,,,,,,Planche,,"Gravure sur acier",1133_SAI_2_016_web,,,,,,,,,,,,,,,,,,,,,,,,,,,,,,,,,,,,"Babylone,Daniel,Grand prophète,Idole,Livre de Daniel,Prêtre,Temple",https://hieronyma.ict-toulouse.fr/files/original/45b039fb609cff709f4ff556946f75a7.JPG,,"La Sainte Bible : traduction nouvelle selon la Vulgate",1,0
"Daniel fait mourir le dragon.",,,,,,,,,,"Image mi-page","français ; latin","Gravure sur cuivre",PAT_18G_001_152a,,,,,,,,,,,,,,,,,,,,,,,,,,,,,,,,,,,,"Daniel,Dragon,Grand prophète,Livre de Daniel,Mise à mort,Nourriture,Roi,Temple",https://hieronyma.ict-toulouse.fr/files/original/35ff9bfef912d44201848febb1abbc35.JPG,,"L'Ancien et le Nouveau Testament représentés en cinq cens tableaux gravés d'après les desseins de Raphaël & autres grands maîtres et expliqués par les paroles de l'Ecriture",1,0
"David chez Achimelech",,,,,,,,,,"Image mi-page","français ; latin","Gravure sur cuivre",PAT_18G_001_107_web_b,,,,,,,,,,,,,,,,,,,,,,,,,,,,,,,,,,,,"Ahimélek,David,Don,Épée,Le chandelier à sept branches,Mobilier biblique,Pain,Premier Livre de Samuel,Prêtre,Table des pains de proposition,Temple",https://hieronyma.ict-toulouse.fr/files/original/b33f1443010f0aaf2b0abae03aa6702b.JPG,,"L'Ancien et le Nouveau Testament représentés en cinq cens tableaux gravés d'après les desseins de Raphaël & autres grands maîtres et expliqués par les paroles de l'Ecriture",1,0
"Dieu se Manifeste a Samuel",,,,,,,,,,"Image mi-page","français ; latin","Gravure sur cuivre",PAT_18G_001_099_web_a,,,,,,,,,,,,,,,,,,,,,,,,,,,,,,,,,,,,"Éli,L'arche d'alliance,Le chandelier à sept branches,Lit,Mobilier biblique,Premier Livre de Samuel,Samuel,Sommeil,Table des pains de proposition,Temple",https://hieronyma.ict-toulouse.fr/files/original/965171bf8969e7330ae4a71589f274e9.JPG,,"L'Ancien et le Nouveau Testament représentés en cinq cens tableaux gravés d'après les desseins de Raphaël & autres grands maîtres et expliqués par les paroles de l'Ecriture",1,0
"Dimora in Egitto",,,,,,,,,,Vignette,,"Gravure sur cuivre",CAP_18P_084_021_web,,,,,,,,,,,,,,,,,,,,,,,,,,,,,,,,,,,,"Ange,Chute,Égypte,Enfance du Christ,Enfant Jésus,Extérieur,Intérieur,Nouveau Testament,Saint Joseph,Sainte Famille,Statue,Temple,Vierge",https://hieronyma.ict-toulouse.fr/files/original/97f2fc0531b1ccf3a4ee948767575d6e.JPG,"Image fixe","La Santa infanzia di Gesu bambino",1,0
