﻿"Dublin Core:Title","Dublin Core:Subject","Dublin Core:Description","Dublin Core:Creator","Dublin Core:Source","Dublin Core:Publisher","Dublin Core:Date","Dublin Core:Contributor","Dublin Core:Rights","Dublin Core:Relation","Dublin Core:Format","Dublin Core:Language","Dublin Core:Type","Dublin Core:Identifier","Dublin Core:Coverage","Item Type Metadata:Text","Item Type Metadata:Interviewer","Item Type Metadata:Interviewee","Item Type Metadata:Location","Item Type Metadata:Transcription","Item Type Metadata:Local URL","Item Type Metadata:Original Format","Item Type Metadata:Physical Dimensions","Item Type Metadata:Duration","Item Type Metadata:Compression","Item Type Metadata:Producer","Item Type Metadata:Director","Item Type Metadata:Bit Rate/Frequency","Item Type Metadata:Time Summary","Item Type Metadata:Email Body","Item Type Metadata:Subject Line","Item Type Metadata:From","Item Type Metadata:To","Item Type Metadata:CC","Item Type Metadata:BCC","Item Type Metadata:Number of Attachments","Item Type Metadata:Standards","Item Type Metadata:Objectives","Item Type Metadata:Materials","Item Type Metadata:Lesson Plan Text","Item Type Metadata:URL","Item Type Metadata:Event Type","Item Type Metadata:Participants","Item Type Metadata:Birth Date","Item Type Metadata:Birthplace","Item Type Metadata:Death Date","Item Type Metadata:Occupation","Item Type Metadata:Biographical Text","Item Type Metadata:Bibliography",tags,file,itemType,collection,public,featured
"Saul prophetise avec les prophetes.",,,,,,,,,,"Image mi-page","français ; latin","Gravure sur cuivre",PAT_18G_001_106_web_b,,,,,,,,,,,,,,,,,,,,,,,,,,,,,,,,,,,,"Instrument de musique,Musicien,Premier Livre de Samuel,Prophète,Samuel,Saül",https://hieronyma.ict-toulouse.fr/files/original/5f834ec0a9bfb88f6f3d574e6919dcb6.JPG,,"L'Ancien et le Nouveau Testament représentés en cinq cens tableaux gravés d'après les desseins de Raphaël & autres grands maîtres et expliqués par les paroles de l'Ecriture",1,0
"Samuel sacre David.",,,,,,,,,,"Image mi-page","français ; latin","Gravure sur cuivre",PAT_18G_001_103_web_a,,,,,,,,,,,,,,,,,,,,,,,,,,,,,,,,,,,,"Autel,Berger,David,Famille,Huile,Premier Livre de Samuel,Sacre,Sacrifice,Samuel",https://hieronyma.ict-toulouse.fr/files/original/504379ff68bde0d2e42a936a656e95fb.JPG,,"L'Ancien et le Nouveau Testament représentés en cinq cens tableaux gravés d'après les desseins de Raphaël & autres grands maîtres et expliqués par les paroles de l'Ecriture",1,0
"Agag mis en pieces par Samuel.",,,,,,,,,,"Image mi- page","français ; latin","Gravure sur cuivre",PAT_18G_001_102_web_b,,,,,,,,,,,,,,,,,,,,,,,,,,,,,,,,,,,,"Agag,Mort par le fer,Peine de mort,Premier Livre de Samuel,Roi,Samuel,Saül",https://hieronyma.ict-toulouse.fr/files/original/6e27346c98f6b28a8c6fdc3750bf705b.JPG,,"L'Ancien et le Nouveau Testament représentés en cinq cens tableaux gravés d'après les desseins de Raphaël & autres grands maîtres et expliqués par les paroles de l'Ecriture",1,0
"Samuel oint Saul roi.",,,,,,,,,,"Image mi-page","français ; latin","Gravure sur cuivre",PAT_18G_001_101_web_b,,,,,,,,,,,,,,,,,,,,,,,,,,,,,,,,,,,,"Huile,Premier Livre de Samuel,Rempart,Sacre,Samuel,Saül,Ville",https://hieronyma.ict-toulouse.fr/files/original/c33c90fb3a76b5392e92bdcd2759e42c.JPG,,"L'Ancien et le Nouveau Testament représentés en cinq cens tableaux gravés d'après les desseins de Raphaël & autres grands maîtres et expliqués par les paroles de l'Ecriture",1,0
"Samuel Juge Israel a Masphat",,,,,,,,,,"Image mi-page","français ; latin","Gravure sur cuivre",PAT_18G_001_101_web_a,,,,,,,,,,,,,,,,,,,,,,,,,,,,,,,,,,,,"Autel,Eau,Foule,Premier Livre de Samuel,Rite de purification,Samuel,Ville",https://hieronyma.ict-toulouse.fr/files/original/bc07c78bd7d0380fbc063f7076156ecf.JPG,,"L'Ancien et le Nouveau Testament représentés en cinq cens tableaux gravés d'après les desseins de Raphaël & autres grands maîtres et expliqués par les paroles de l'Ecriture",1,0
"Dieu se Manifeste a Samuel",,,,,,,,,,"Image mi-page","français ; latin","Gravure sur cuivre",PAT_18G_001_099_web_a,,,,,,,,,,,,,,,,,,,,,,,,,,,,,,,,,,,,"Éli,L'arche d'alliance,Le chandelier à sept branches,Lit,Mobilier biblique,Premier Livre de Samuel,Samuel,Sommeil,Table des pains de proposition,Temple",https://hieronyma.ict-toulouse.fr/files/original/965171bf8969e7330ae4a71589f274e9.JPG,,"L'Ancien et le Nouveau Testament représentés en cinq cens tableaux gravés d'après les desseins de Raphaël & autres grands maîtres et expliqués par les paroles de l'Ecriture",1,0
"Ruth suit Noémi. Défaite de Saül",,,,,,,,,,"Pleine page",,"Gravure sur cuivre",PAT_19P_004_005_web,,,,,,,,,,,,,,,,,,,,,,,,,,,,,,,,,,,,"Agenouillé,Apparition,Blé,Booz,Champ,Divination,Fantôme,Femme,Fumée,Gratitude,Intérieur,Ruth,Samuel,Saül,Savignac",https://hieronyma.ict-toulouse.fr/files/original/09229c3d8bd57ef3c5744235180345df.jpg,"Image fixe","Histoire de la Sainte Bible...",1,0
"[La Pythonisse d'Endor fait apparaître l'ombre de Samuel]",,,,,,,,,,"Pleine page",,"Gravure sur bois",PAT_16M_022_168_web,,,,,,,,,,,,,,,,,,,,,,,,,,,,,,,,,,,,"Divination,Évanouissement,Fantôme,Premier Livre de Samuel,Pythonisse d'Endor,Samuel,Saül",https://hieronyma.ict-toulouse.fr/files/original/c3c884785fbef759cdf2cf2192ee3b75.JPG,"Image fixe","[Bible, latin, 1574]",1,0
"[L'onction de David]",,"Réemploi de la gravure illustrant le chapitre 10 du Premier Livre de Samuel.",,,,,,,,"Pleine page",,"Gravure sur bois",PAT_16M_022_159_web,,,,,,,,,,,,,,,,,,,,,,,,,,,,,,,,,,,,"Agenouillé,David,Huile,Premier Livre de Samuel,Sacre,Samuel",https://hieronyma.ict-toulouse.fr/files/original/f4b5a08dcd87aba10041796766a1e4de.JPG,"Image fixe","[Bible, latin, 1574]",1,0
"[Samuel exécute Agag]",,,,,,,,,,"Pleine page",,"Gravure sur bois",PAT_16M_022_158_web,,,,,,,,,,,,,,,,,,,,,,,,,,,,,,,,,,,,"Agag,Couronne,Mort par le fer,Peine de mort,Premier Livre de Samuel,Roi,Samuel,Saül",https://hieronyma.ict-toulouse.fr/files/original/1298280589de6c2a740aa82eb4f14752.JPG,"Image fixe","[Bible, latin, 1574]",1,0
