﻿"Dublin Core:Title","Dublin Core:Subject","Dublin Core:Description","Dublin Core:Creator","Dublin Core:Source","Dublin Core:Publisher","Dublin Core:Date","Dublin Core:Contributor","Dublin Core:Rights","Dublin Core:Relation","Dublin Core:Format","Dublin Core:Language","Dublin Core:Type","Dublin Core:Identifier","Dublin Core:Coverage","Item Type Metadata:Text","Item Type Metadata:Interviewer","Item Type Metadata:Interviewee","Item Type Metadata:Location","Item Type Metadata:Transcription","Item Type Metadata:Local URL","Item Type Metadata:Original Format","Item Type Metadata:Physical Dimensions","Item Type Metadata:Duration","Item Type Metadata:Compression","Item Type Metadata:Producer","Item Type Metadata:Director","Item Type Metadata:Bit Rate/Frequency","Item Type Metadata:Time Summary","Item Type Metadata:Email Body","Item Type Metadata:Subject Line","Item Type Metadata:From","Item Type Metadata:To","Item Type Metadata:CC","Item Type Metadata:BCC","Item Type Metadata:Number of Attachments","Item Type Metadata:Standards","Item Type Metadata:Objectives","Item Type Metadata:Materials","Item Type Metadata:Lesson Plan Text","Item Type Metadata:URL","Item Type Metadata:Event Type","Item Type Metadata:Participants","Item Type Metadata:Birth Date","Item Type Metadata:Birthplace","Item Type Metadata:Death Date","Item Type Metadata:Occupation","Item Type Metadata:Biographical Text","Item Type Metadata:Bibliography",tags,file,itemType,collection,public,featured
"La prison de Paul et de Silas s'ouvre.",,,,,,,,,,"Image mi-page","français ; latin","Gravure sur cuivre",PAT_18G_001_234b,,,,,,,,,,,,,,,,,,,,,,,,,,,,,,,,,,,,"Actes des Apôtres,Épée,Miracle,Prison,Prisonnier,Saint Paul de Tarse",https://hieronyma.ict-toulouse.fr/files/original/5348526bccd7f330cb0566fe234d7324.JPG,,"L'Ancien et le Nouveau Testament représentés en cinq cens tableaux gravés d'après les desseins de Raphaël & autres grands maîtres et expliqués par les paroles de l'Ecriture",1,0
"Le Symbole des Apostres",,,,,,,,,,"Image pleine page","français ; latin","Gravure sur cuivre",PAT_17P_618_018_web,,,,,,,,,,,,,,,,,,,,,,,,,,,,,,,,,,,,"Agenouillé,Ange,Bateau à voiles,Bâton,Christ,Clé,Couronne,Couronnement,Croix,Croix de Saint-André,Dieu le Père,Échelle,Enfant,Gobelet,Hache,Jacob,Les Apôtres,Livre,Louis XIII,Palme,Pèlerin,Prière,Saint André,Saint Barthélemy,Saint Jacques le Majeur,Saint Jacques le Mineur,Saint Jean,Saint Matthias,Saint Matthieu,Saint Paul de Tarse,Saint Philippe,Saint Pierre,Saint Simon,Saint Thomas,Serpent,Sommeil,Songe,Tempête",https://hieronyma.ict-toulouse.fr/files/original/bff57449df5991e37c973feaf349594c.jpg,"Image fixe","Catechisme Royal",1,0
"Les festes du mois de iuin : St Boniface, St Pierre et St Paul, St Medard, St Claude,  La nativité de St Jean, S. Barnabe, S. Antoine de Pade, S. Gervais et Protais, St Basile",,,,,,,,,,"Image pleine page",français,"Gravure sur cuivre",PAT_17G_193_010_web,,,,,,,,,,,,,,,,,,,,,,,,,,,,,,,,,,,,"Arbre,Chambre,Clé,Crosse,Crucifix,Délivrance,Enfant,Enfant Jésus,Épée,Évêque,Feu,Fleur,Fouet,Lapidation,Mitre,Naissance,Nourrisson,Palme,Pierre,Prisonnier,Saint Antoine de Padoue,Saint Barnabé,Saint Basile de Césarée,Saint Boniface de Mayence,Saint Claude de Besançon,Saint Gervais,Saint Jean Baptiste,Saint Médard,Saint Paul de Tarse,Saint Pierre,Saint Protais,Sainte Elisabeth,Toilette",https://hieronyma.ict-toulouse.fr/files/original/f99d8d909fe53b1480c312414fa0495e.jpg,,"Les Fleurs des Vies des saints... [1678]",1,0
"Les festes du mois de janvier : S. Genevieeve, Les Roys, S. Hilaire, S. Anthoine, La Circoncision, S. Sebastien, S. Agnes, Conversion S. Paul, S. Charlemagne",,,,,,,,,,"Image pleine page",français,"Gravure sur cuivre",PAT_17G_193_005_web,,,,,,,,,,,,,,,,,,,,,,,,,,,,,,,,,,,,"Adoration des Mages,Agneau,Ange,Apparition,Auréole,Chandelle,Cheval,Chute,Circoncision,Conversion,Couronne,Croix en tau,Crosse,Diable,Don,Enfance du Christ,Enfant Jésus,Épée,Étable,Étoile,Évêque,Flèche,Globe,Lecture,Les Mages,Livre,Martyre,Mitre,Palme,Porc,Saint Antoine Abbé,Saint Charlemagne,Saint Hilaire de Poitiers,Saint Joseph,Saint Paul de Tarse,Saint Sébastien,Sainte Agnès de Rome,Sainte Geneviève de Paris,Souffle,Vierge",https://hieronyma.ict-toulouse.fr/files/original/43211265d46464936fec572abb4f491b.jpg,,"Les Fleurs des Vies des saints... [1678]",1,0
"Martyre de St Êtienne",,,,,,,,,,"Image mi-page","français ; latin","Gravure sur cuivre",PAT_18G_001_228b,,,,,,,,,,,,,,,,,,,,,,,,,,,,,,,,,,,,"Actes des Apôtres,Lapidation,Manteau,Martyre,Mort,Pierre,Saint Étienne,Saint Paul de Tarse",https://hieronyma.ict-toulouse.fr/files/original/7aae75118b7312f46031a991ebeea5b1.JPG,,"L'Ancien et le Nouveau Testament représentés en cinq cens tableaux gravés d'après les desseins de Raphaël & autres grands maîtres et expliqués par les paroles de l'Ecriture",1,0
"Naufrage de St Paul",,,,,,,,,,"Image mi-page","français ; latin","Gravure sur cuivre",PAT_18G_001_237b,,,,,,,,,,,,,,,,,,,,,,,,,,,,,,,,,,,,"Actes des Apôtres,Bateau à voiles,Mer,Naufrage,Saint Paul de Tarse,Tempête",https://hieronyma.ict-toulouse.fr/files/original/8b6bd8ecf1cdf0175a1538e2b50c086a.JPG,,"L'Ancien et le Nouveau Testament représentés en cinq cens tableaux gravés d'après les desseins de Raphaël & autres grands maîtres et expliqués par les paroles de l'Ecriture",1,0
"Paul et Barnabé pris pour des dieux par les listriens.",,,,,,,,,,"Image mi-page","français ; latin","Gravure sur cuivre",PAT_18G_001_233a,,,,,,,,,,,,,,,,,,,,,,,,,,,,,,,,,,,,"Actes des Apôtres,Boeuf,Procession,Refus,Sacrifice,Saint Barnabé,Saint Paul de Tarse,Vêtement",https://hieronyma.ict-toulouse.fr/files/original/73e7f2e7b4ef8bcd5cdd66086864cbeb.JPG,,"L'Ancien et le Nouveau Testament représentés en cinq cens tableaux gravés d'après les desseins de Raphaël & autres grands maîtres et expliqués par les paroles de l'Ecriture",1,0
"Pythonisse delivrée par Paul et Silas",,,,,,,,,,"Image mi-page","français ; latin","Gravure sur cuivre",PAT_18G_001_234a,,,,,,,,,,,,,,,,,,,,,,,,,,,,,,,,,,,,"Actes des Apôtres,Délivrance de possédé,Femme,Miracle,Prophète,Saint Paul de Tarse",https://hieronyma.ict-toulouse.fr/files/original/92345268c4cde1ce476d35a1ea36f2aa.JPG,,"L'Ancien et le Nouveau Testament représentés en cinq cens tableaux gravés d'après les desseins de Raphaël & autres grands maîtres et expliqués par les paroles de l'Ecriture",1,0
"Saint Paul à Éphèse.",,,,,,,,,,Planche,,"Gravure sur acier",1133_SAI_2_103_web,,,,,,,,,,,,,,,,,,,,,,,,,,,,,,,,,,,,"Actes des Apôtres,Destruction,Éphèse,Feu,Livre manuscrit,Saint Paul de Tarse,Temple",https://hieronyma.ict-toulouse.fr/files/original/bcc5cf8e33311c56b57298c00bda268a.JPG,,"La Sainte Bible : traduction nouvelle selon la Vulgate",1,0
"Saint Paul abordant à l'île de Malte",,,,,,,,,,Planche,,"Gravure sur acier",1133_SAI_2_105_web,,,,,,,,,,,,,,,,,,,,,,,,,,,,,,,,,,,,"Actes des Apôtres,Arrivée,Bateau,Bord de mer,Naufrage,Saint Paul de Tarse",https://hieronyma.ict-toulouse.fr/files/original/67e8fd0737e4cd23136a9018e4485d08.JPG,,"La Sainte Bible : traduction nouvelle selon la Vulgate",1,0
