﻿"Dublin Core:Title","Dublin Core:Subject","Dublin Core:Description","Dublin Core:Creator","Dublin Core:Source","Dublin Core:Publisher","Dublin Core:Date","Dublin Core:Contributor","Dublin Core:Rights","Dublin Core:Relation","Dublin Core:Format","Dublin Core:Language","Dublin Core:Type","Dublin Core:Identifier","Dublin Core:Coverage","Item Type Metadata:Text","Item Type Metadata:Interviewer","Item Type Metadata:Interviewee","Item Type Metadata:Location","Item Type Metadata:Transcription","Item Type Metadata:Local URL","Item Type Metadata:Original Format","Item Type Metadata:Physical Dimensions","Item Type Metadata:Duration","Item Type Metadata:Compression","Item Type Metadata:Producer","Item Type Metadata:Director","Item Type Metadata:Bit Rate/Frequency","Item Type Metadata:Time Summary","Item Type Metadata:Email Body","Item Type Metadata:Subject Line","Item Type Metadata:From","Item Type Metadata:To","Item Type Metadata:CC","Item Type Metadata:BCC","Item Type Metadata:Number of Attachments","Item Type Metadata:Standards","Item Type Metadata:Objectives","Item Type Metadata:Materials","Item Type Metadata:Lesson Plan Text","Item Type Metadata:URL","Item Type Metadata:Event Type","Item Type Metadata:Participants","Item Type Metadata:Birth Date","Item Type Metadata:Birthplace","Item Type Metadata:Death Date","Item Type Metadata:Occupation","Item Type Metadata:Biographical Text","Item Type Metadata:Bibliography",tags,file,itemType,collection,public,featured
"[Les quatre Évangélistes]",,,,,,,,,,"Image mi-page",,"Gravure sur cuivre",CAP_17G_046_058_web,,,,,,,,,,,,,,,,,,,,,,,,,,,,,,,,,,,,"Aigle de saint Jean,Boeuf de saint Luc,Encrier,Homme de saint Matthieu,Instrument d'écriture,Les Évangelistes,Lion de saint Marc,Livre manuscrit,Nouveau Testament,Rouleau,Saint Jean,Saint Luc,Saint Marc,Saint Matthieu",https://hieronyma.ict-toulouse.fr/files/original/e539f8dd75d2d9827256b330e9c4b7dc.JPG,"Image fixe","La Sainte Bible",1,0
"[Les vingt-quatre Vieillards de l'Apocalypse entourent l'Agneau et le Livre aux sept sceaux]",,,,,,,,,,Vignette,latin,"Gravure sur bois",PAT_16M_022_432_web,,,,,,,,,,,,,,,,,,,,,,,,,,,,,,,,,,,,"Agneau,Christ,Couronne,Dieu le Père,Harpe,Le Tétramorphe,Livre,Livre de l'Apocalypse,Rayons lumineux,Roi,Saint Jean,Sceau,Torche,Trône,Vieillards de l'Apocalypse,Vision",https://hieronyma.ict-toulouse.fr/files/original/a30d4f27f6350fb314b9813cc5e74ee5.jpg,,"[Bible, latin, 1574]",1,0
"[Saint Jean reçoit le livre que lui donne un ange. Les deux Témoins]",,,,,,,,,,Vignettes,latin,"Gravure sur bois",PAT_16M_022_437_web,,,,,,,,,,,,,,,,,,,,,,,,,,,,,,,,,,,,"Ange,Antichrist,Cadavre,Colonne,Dieu le Père,Don,Dragon,Feu,Livre,Livre de l'Apocalypse,Meurtre,Prophète,Résurrection,Saint Jean,Soleil,Ville,Vision",https://hieronyma.ict-toulouse.fr/files/original/05d375859c86c2375a74f2cd03e2a286.jpg,,"[Bible, latin, 1574]",1,0
"[Scènes de la Passion]",,,,,,,,,,Vignettes,latin,"Gravure sur bois",PAT_16M_022_330_web,,,,,,,,,,,,,,,,,,,,,,,,,,,,,,,,,,,,"Christ,Christ mort,Crucifixion,Descente de Croix,Échelle,Évangile selon saint Matthieu,La Croix,Le coup de lance,Le Crucifiement,Les instruments de la Passion,Les larrons,Les Saintes Femmes,Mise au tombeau,Pâmoison de la Vierge,Passion,Présentation du vinaigre,Saint Jean,Soldat,Tombeau",https://hieronyma.ict-toulouse.fr/files/original/edbcbdb30ed2e7ca9f5cdf12bcf8f804.jpg,,"[Bible, latin, 1574]",1,0
"[Scènes de la Passion]",,,,,,,,,,Vignettes,latin,"Gravure sur bois",PAT_16M_022_352_web,,,,,,,,,,,,,,,,,,,,,,,,,,,,,,,,,,,,"Christ,Christ mort,Crucifixion,Descente de Croix,Évangile selon saint Marc,Le coup de lance,Le Crucifiement,Les instruments de la Passion,Les larrons,Les Saintes Femmes,Lune,Mise au tombeau,Pâmoison de la Vierge,Passion,Présentation du vinaigre,Saint Jean,Soldat,Soleil",https://hieronyma.ict-toulouse.fr/files/original/ef576473044928ba6e3f53a165043f09.jpg,,"[Bible, latin, 1574]",1,0
"[Scènes de la Passion]",,,,,,,,,,Vignettes,latin,"Gravure sur bois",PAT_16M_022_385_web,,,,,,,,,,,,,,,,,,,,,,,,,,,,,,,,,,,,"Christ,Christ mort,Crucifixion,Descente de Croix,Évangile selon saint Luc,La Croix,Le coup de lance,Les instruments de la Passion,Les larrons,Les Saintes Femmes,Mise au tombeau,Pâmoison de la Vierge,Passion,Présentation du vinaigre,Saint Jean,Soldat,Tombeau,Vierge",https://hieronyma.ict-toulouse.fr/files/original/14a925ce73331b7a47f6ec3a8cb62e0f.jpg,,"[Bible, latin, 1574]",1,0
"Boiteux guéri par St Pierre a la porte du temple",,,,,,,,,,"Image mi-page","français ; latin","Gravure sur cuivre",PAT_18G_001_227a,,,,,,,,,,,,,,,,,,,,,,,,,,,,,,,,,,,,"Actes des Apôtres,Guérison miraculeuse,Infirme,Le Temple,Mendicité,Miracle,Porte,Saint Jean,Saint Pierre",https://hieronyma.ict-toulouse.fr/files/original/363ad3867ca8a4d0eed1dc14073ad807.JPG,,"L'Ancien et le Nouveau Testament représentés en cinq cens tableaux gravés d'après les desseins de Raphaël & autres grands maîtres et expliqués par les paroles de l'Ecriture",1,0
"Descente de la croix.",,,,,,,,,,Planche,,"Gravure sur acier",1133_SAI_2_089_web,,,,,,,,,,,,,,,,,,,,,,,,,,,,,,,,,,,,"Christ,Descente de Croix,Évangile selon saint Jean,La Croix,Passion,Saint Jean,Saint Joseph d'Arimathie,Sainte Madeleine,Vierge",https://hieronyma.ict-toulouse.fr/files/original/7081f447e55e54f0cc47046b01284d5d.JPG,,"La Sainte Bible : traduction nouvelle selon la Vulgate",1,0
"L'ange montre Jérusalem à saint Jean.",,,,,,,,,,Planche,,"Gravure sur acier",1133_SAI_2_110_web,,,,,,,,,,,,,,,,,,,,,,,,,,,,,,,,,,,,"Ange,Apocalypse,Jérusalem céleste,Rayons lumineux,Saint Jean,Ville",https://hieronyma.ict-toulouse.fr/files/original/bd4a7c1a75f40a714fc9629e5d76ac70.JPG,,"La Sainte Bible : traduction nouvelle selon la Vulgate",1,1
"La Transfiguration",,,,,,,,,,Planche,,"Gravure sur acier",1133_SAI_2_058_web,,,,,,,,,,,,,,,,,,,,,,,,,,,,,,,,,,,,"Apparition,Christ,Élie,Évangile selon saint Matthieu,Les Tables de la Loi,Moïse,Montagne,Rayons lumineux,Saint Jacques le Majeur,Saint Jean,Saint Pierre,Transfiguration",https://hieronyma.ict-toulouse.fr/files/original/b187749e95cd49d12e5ede8732041f83.JPG,,"La Sainte Bible : traduction nouvelle selon la Vulgate",1,0
