﻿"Dublin Core:Title","Dublin Core:Subject","Dublin Core:Description","Dublin Core:Creator","Dublin Core:Source","Dublin Core:Publisher","Dublin Core:Date","Dublin Core:Contributor","Dublin Core:Rights","Dublin Core:Relation","Dublin Core:Format","Dublin Core:Language","Dublin Core:Type","Dublin Core:Identifier","Dublin Core:Coverage","Item Type Metadata:Text","Item Type Metadata:Interviewer","Item Type Metadata:Interviewee","Item Type Metadata:Location","Item Type Metadata:Transcription","Item Type Metadata:Local URL","Item Type Metadata:Original Format","Item Type Metadata:Physical Dimensions","Item Type Metadata:Duration","Item Type Metadata:Compression","Item Type Metadata:Producer","Item Type Metadata:Director","Item Type Metadata:Bit Rate/Frequency","Item Type Metadata:Time Summary","Item Type Metadata:Email Body","Item Type Metadata:Subject Line","Item Type Metadata:From","Item Type Metadata:To","Item Type Metadata:CC","Item Type Metadata:BCC","Item Type Metadata:Number of Attachments","Item Type Metadata:Standards","Item Type Metadata:Objectives","Item Type Metadata:Materials","Item Type Metadata:Lesson Plan Text","Item Type Metadata:URL","Item Type Metadata:Event Type","Item Type Metadata:Participants","Item Type Metadata:Birth Date","Item Type Metadata:Birthplace","Item Type Metadata:Death Date","Item Type Metadata:Occupation","Item Type Metadata:Biographical Text","Item Type Metadata:Bibliography",tags,file,itemType,collection,public,featured
"[Guérison d'un aveugle. La Transfiguration]",,,,,,,,,,Vignettes,latin,"Gravure sur bois",PAT_16M_022_342_web,,,,,,,,,,,,,,,,,,,,,,,,,,,,,,,,,,,,"Apparition,Aveugle,Bâton,Élie,Évangile selon saint Marc,Jésus guérissant,Les Tables de la Loi,Miracle du Christ,Moïse,Rayons lumineux,Saint Jacques le Majeur,Saint Jean,Saint Pierre,Transfiguration",https://hieronyma.ict-toulouse.fr/files/original/884f02c47139b2f7fcaa814cfe25547a.jpg,,"[Bible, latin, 1574]",1,0
"[Jésus enseignant. La Transfiguration]",,,,,,,,,,Vignettes,latin,"Gravure sur bois",PAT_16M_022_316_web,,,,,,,,,,,,,,,,,,,,,,,,,,,,,,,,,,,,"Apparition,Christ,Christ enseignant,Élie,Évangile selon saint Matthieu,Les Tables de la Loi,Moïse,Rayons lumineux,Saint Jacques le Majeur,Saint Jean,Saint Pierre,Transfiguration",https://hieronyma.ict-toulouse.fr/files/original/2e60532def7ed8e955c2a8151dfa1e1e.jpg,,"[Bible, latin, 1574]",1,0
"[La Transfiguration. Jésus guérit un enfant possédé. Le Christ enseignant]",,,,,,,,,,Vignettes,latin,"Gravure sur bois",PAT_16M_022_369_web,,,,,,,,,,,,,,,,,,,,,,,,,,,,,,,,,,,,"Apparition,Bénédiction,Christ,Christ enseignant,Délivrance de possédé,Élie,Enfant,Évangile selon saint Luc,Jésus guérissant,Les Tables de la Loi,Moïse,Rayons lumineux,Saint Jacques le Majeur,Saint Jean,Saint Pierre,Transfiguration",https://hieronyma.ict-toulouse.fr/files/original/8fab6dd576c98f9d94710ab14e189589.jpg,,"[Bible, latin, 1574]",1,0
"[La vocation des apôtres. Jésus guérit un lépreux. Guérison d'un paralysé]",,,,,,,,,,Vignettes,latin,"Gravure sur bois",PAT_16M_022_361_web,,,,,,,,,,,,,,,,,,,,,,,,,,,,,,,,,,,,"Agenouillé,Barque,Christ,Couché,Évangile selon saint Luc,Filet,Foule,Infirme,Jésus guérissant,Lac de Tibériade,Lèpre,Pêche,Pêcheur,Saint Jacques le Majeur,Saint Jean,Saint Pierre,Vocation des apôtres",https://hieronyma.ict-toulouse.fr/files/original/3f530bfd0c7f66cf8394d7ab3dfb976d.jpg,,"[Bible, latin, 1574]",1,0
"La Transfiguration",,,,,,,,,,Planche,,"Gravure sur acier",1133_SAI_2_058_web,,,,,,,,,,,,,,,,,,,,,,,,,,,,,,,,,,,,"Apparition,Christ,Élie,Évangile selon saint Matthieu,Les Tables de la Loi,Moïse,Montagne,Rayons lumineux,Saint Jacques le Majeur,Saint Jean,Saint Pierre,Transfiguration",https://hieronyma.ict-toulouse.fr/files/original/b187749e95cd49d12e5ede8732041f83.JPG,,"La Sainte Bible : traduction nouvelle selon la Vulgate",1,0
"La transfiguration de Jesus Christ",,,,,,,,,,"Image mi-page","français ; latin","Gravure sur cuivre",PAT_18G_001_191a,,,,,,,,,,,,,,,,,,,,,,,,,,,,,,,,,,,,"Apparition,Christ,Élie,Évangile selon saint Matthieu,Moïse,Montagne,Rayons lumineux,Saint Jacques le Majeur,Saint Jean,Saint Pierre,Transfiguration",https://hieronyma.ict-toulouse.fr/files/original/76ed14cb66bc3a478ed6848b73b437ba.JPG,,"L'Ancien et le Nouveau Testament représentés en cinq cens tableaux gravés d'après les desseins de Raphaël & autres grands maîtres et expliqués par les paroles de l'Ecriture",1,0
"Le corps de S. Iacques Ma. [Apôtre]",,,,,,,,,,Planche,,"Gravure sur cuivre",PAT_18P_261_012_web,,,,,,,,,,,,,,,,,,,,,,,,,,,,,,,,,,,,"Autel,Basilique Saint-Sernin,Bateau à voiles,Martyre,Peinture murale,Pèlerin,Reliquaire,Saint Jacques le Majeur,Toulouse",https://hieronyma.ict-toulouse.fr/files/original/512bcd1adc68e9d5f75355acd6abce71.JPG,"Image fixe","Antiennes et oraisons [...]",1,0
"Le Symbole des Apostres",,,,,,,,,,"Image pleine page","français ; latin","Gravure sur cuivre",PAT_17P_618_018_web,,,,,,,,,,,,,,,,,,,,,,,,,,,,,,,,,,,,"Agenouillé,Ange,Bateau à voiles,Bâton,Christ,Clé,Couronne,Couronnement,Croix,Croix de Saint-André,Dieu le Père,Échelle,Enfant,Gobelet,Hache,Jacob,Les Apôtres,Livre,Louis XIII,Palme,Pèlerin,Prière,Saint André,Saint Barthélemy,Saint Jacques le Majeur,Saint Jacques le Mineur,Saint Jean,Saint Matthias,Saint Matthieu,Saint Paul de Tarse,Saint Philippe,Saint Pierre,Saint Simon,Saint Thomas,Serpent,Sommeil,Songe,Tempête",https://hieronyma.ict-toulouse.fr/files/original/bff57449df5991e37c973feaf349594c.jpg,"Image fixe","Catechisme Royal",1,0
"Les festes du mois de iuillet : Saint Bonaventure, Sainte Anne, Ste Marguerite, S. Jacques, La Visitation N. Dame, Saint Christophe, St Victor, Sainte Madeleine, Ste Marthe",,,,,,,,,,"Image pleine page",français,"Gravure sur cuivre",PAT_17G_193_012_web,,,,,,,,,,,,,,,,,,,,,,,,,,,,,,,,,,,,"Auréole,Bâton,Cheveux,Crâne,Croix,Crucifix,Dragon,Enfant,Enfant Jésus,Famille,Fleuve,Instruction,Lecture,Moulin à vent,Palme,Pèlerin,Prière,Religieux,Saint Bonaventure,Saint Christophe,Saint Jacques le Majeur,Saint Victor de Marseille,Sainte Anne,Sainte Elisabeth,Sainte Madeleine,Sainte Marguerite d'Antioche,Sainte Marthe,Soldat,Vierge,Visitation",https://hieronyma.ict-toulouse.fr/files/original/6f7c961e080ee5a9315b062fac651d3c.jpg,,"Les Fleurs des Vies des saints... [1678]",1,0
"Prière de Jésus au jardin des Oliviers.",,,,,,,,,,Planche,,"Gravure sur acier",1133_SAI_2_075_web,,,,,,,,,,,,,,,,,,,,,,,,,,,,,,,,,,,,"Christ,Évangile selon saint Matthieu,Jardin,Jardin des oliviers,Olivier,Passion,Prière,Saint Jacques le Majeur,Saint Jean,Saint Pierre,Sommeil",https://hieronyma.ict-toulouse.fr/files/original/73e3f0c116635d415476874cbbda0447.JPG,,"La Sainte Bible : traduction nouvelle selon la Vulgate",1,0
