﻿"Dublin Core:Title","Dublin Core:Subject","Dublin Core:Description","Dublin Core:Creator","Dublin Core:Source","Dublin Core:Publisher","Dublin Core:Date","Dublin Core:Contributor","Dublin Core:Rights","Dublin Core:Relation","Dublin Core:Format","Dublin Core:Language","Dublin Core:Type","Dublin Core:Identifier","Dublin Core:Coverage","Item Type Metadata:Text","Item Type Metadata:Interviewer","Item Type Metadata:Interviewee","Item Type Metadata:Location","Item Type Metadata:Transcription","Item Type Metadata:Local URL","Item Type Metadata:Original Format","Item Type Metadata:Physical Dimensions","Item Type Metadata:Duration","Item Type Metadata:Compression","Item Type Metadata:Producer","Item Type Metadata:Director","Item Type Metadata:Bit Rate/Frequency","Item Type Metadata:Time Summary","Item Type Metadata:Email Body","Item Type Metadata:Subject Line","Item Type Metadata:From","Item Type Metadata:To","Item Type Metadata:CC","Item Type Metadata:BCC","Item Type Metadata:Number of Attachments","Item Type Metadata:Standards","Item Type Metadata:Objectives","Item Type Metadata:Materials","Item Type Metadata:Lesson Plan Text","Item Type Metadata:URL","Item Type Metadata:Event Type","Item Type Metadata:Participants","Item Type Metadata:Birth Date","Item Type Metadata:Birthplace","Item Type Metadata:Death Date","Item Type Metadata:Occupation","Item Type Metadata:Biographical Text","Item Type Metadata:Bibliography",tags,file,itemType,collection,public,featured
"[Jacob et Laban concluent une alliance]",,,,,,,,,,"Pleine page",,"Gravure sur bois",PAT_16M_022_035_web,,,,,,,,,,,,,,,,,,,,,,,,,,,,,,,,,,,,"Alliance,Armée,Assis,Bétail,Enfant,Jacob,Laban,Léa,Livre de la Genèse,Rachel,Rencontre",https://hieronyma.ict-toulouse.fr/files/original/0463ce4e17f714f836516f10eb1ad9d3.jpg,"Image fixe","[Bible, latin, 1574]",1,0
"[Moïse et Aaron s'adressent à Pharaon]",,,,,,,,,,"Pleine page",,"Gravure sur bois",PAT_16M_022_068_web,,,,,,,,,,,,,,,,,,,,,,,,,,,,,,,,,,,,"Aaron,Bâton,Livre de l'Exode,Moïse,Pharaon,Rencontre",https://hieronyma.ict-toulouse.fr/files/original/637e1d06c3ae27c31a390c7ccc08913c.jpg,"Image fixe","[Bible, latin, 1574]",1,0
"[Début du Premier Livre de Samuel : Anne et Éli]",,,,,,,,,,"Pleine page",,"Gravure sur bois",PAT_16M_022_148_web,,,,,,,,,,,,,,,,,,,,,,,,,,,,,,,,,,,,"Anne mère de Samuel,Éli,Extérieur,Porte,Premier Livre de Samuel,Prière,Rencontre,Temple",https://hieronyma.ict-toulouse.fr/files/original/41541314dc4fd5844917ffd424077096.JPG,"Image fixe","[Bible, latin, 1574]",1,0
"Henriade, Chant I",,,,,,,,,,Planche,,"Gravure sur cuivre",PAT_18P_179_001_web,,,,,,,,,,,,,,,,,,,,,,,,,,,,,,,,,,,,"Armée,Cavalier,Henri III (1551-1589, roi de France),Henri IV (1553-1610, roi de France),JEP2019,Rencontre",https://hieronyma.ict-toulouse.fr/files/original/54e6762d42297a242a339b080905c183.jpg,"Image fixe","La Henriade. 1787",1,1
"Abimelech vient trouver Isaac et ils font alliance ensemble",,,,,,,,,,"Image mi-page","français ; latin","Gravure sur cuivre",PAT_18G_001_030_web_a,,,,,,,,,,,,,,,,,,,,,,,,,,,,,,,,,,,,"Abimélek,Alliance,Isaac,Livre de la Genèse,Rencontre,Soldat,Tente",https://hieronyma.ict-toulouse.fr/files/original/31ccc9192ce33a5b4feee8367c8d705e.JPG,,"L'Ancien et le Nouveau Testament représentés en cinq cens tableaux gravés d'après les desseins de Raphaël & autres grands maîtres et expliqués par les paroles de l'Ecriture",1,0
"Jacob et Rachel",,,,,,,,,,"Image mi-page","français ; latin","Gravure sur cuivre",PAT_18G_001_033_web_a,,,,,,,,,,,,,,,,,,,,,,,,,,,,,,,,,,,,"Bergère,Boisson animale,Chèvre,Jacob,Livre de la Genèse,Mouton,Puits,Rachel,Rencontre,Voyageur",https://hieronyma.ict-toulouse.fr/files/original/1c5fee371386eb4b79fc08fac2e79e3c.JPG,,"L'Ancien et le Nouveau Testament représentés en cinq cens tableaux gravés d'après les desseins de Raphaël & autres grands maîtres et expliqués par les paroles de l'Ecriture",1,0
"Verge de Moyse changée en serpent",,,,,,,,,,"Image mi-page","français ; latin","Gravure sur cuivre",PAT_18G_001_053_web_a,,,,,,,,,,,,,,,,,,,,,,,,,,,,,,,,,,,,"Aaron,Bâton,Intérieur,Livre de l'Exode,Miracle,Moïse,Palais,Pharaon,Rencontre,Serpent",https://hieronyma.ict-toulouse.fr/files/original/7a4301baabcb50871ba4d24a4b39459b.JPG,,"L'Ancien et le Nouveau Testament représentés en cinq cens tableaux gravés d'après les desseins de Raphaël & autres grands maîtres et expliqués par les paroles de l'Ecriture",1,0
"David montre a Saul le pan de sa robe qu'il lui avoit coupé.",,,,,,,,,,"Image mi-page","français ; latin","Gravure sur cuivre",PAT_18G_001_109_web_a,,,,,,,,,,,,,,,,,,,,,,,,,,,,,,,,,,,,"Armée,David,Grotte,Manteau,Miséricorde,Premier Livre de Samuel,Rencontre,Saül",https://hieronyma.ict-toulouse.fr/files/original/53ddfcd6f66c305b2e71860f57b981ae.JPG,,"L'Ancien et le Nouveau Testament représentés en cinq cens tableaux gravés d'après les desseins de Raphaël & autres grands maîtres et expliqués par les paroles de l'Ecriture",1,0
"Reine de Saba.",,,,,,,,,,"Image mi-page","français ; latin","Gravure sur cuivre",PAT_18G_001_122a,,,,,,,,,,,,,,,,,,,,,,,,,,,,,,,,,,,,"Don,Premier Livre des Rois,Reine de Saba,Rencontre,Richesse,Salomon",https://hieronyma.ict-toulouse.fr/files/original/fae599337f03455381cac87656af7ce5.JPG,,"L'Ancien et le Nouveau Testament représentés en cinq cens tableaux gravés d'après les desseins de Raphaël & autres grands maîtres et expliqués par les paroles de l'Ecriture",1,0
"[Livre premier : Jeanne d'Arc rencontre Charles VII]",,,,,,,,,,"Image pleine page",,"Gravure sur cuivre",PAT_17P_688_002_web,,,,,,,,,,,,,,,,,,,,,,,,,,,,,,,,,,,,"Ange,Apparition,Bergère,Charles VII (1403-1461, roi de France),Intérieur,Jeanne d'Arc (1412-1431, sainte),Nuée,Palais,Rencontre",https://hieronyma.ict-toulouse.fr/files/original/26ee2edadcdd680e6d22894b3787fbc8.jpg,,"La pucelle, : ou la France délivrée : poëme héroïque / par M. Chapelain",1,0
