﻿"Dublin Core:Title","Dublin Core:Subject","Dublin Core:Description","Dublin Core:Creator","Dublin Core:Source","Dublin Core:Publisher","Dublin Core:Date","Dublin Core:Contributor","Dublin Core:Rights","Dublin Core:Relation","Dublin Core:Format","Dublin Core:Language","Dublin Core:Type","Dublin Core:Identifier","Dublin Core:Coverage","Item Type Metadata:Text","Item Type Metadata:Interviewer","Item Type Metadata:Interviewee","Item Type Metadata:Location","Item Type Metadata:Transcription","Item Type Metadata:Local URL","Item Type Metadata:Original Format","Item Type Metadata:Physical Dimensions","Item Type Metadata:Duration","Item Type Metadata:Compression","Item Type Metadata:Producer","Item Type Metadata:Director","Item Type Metadata:Bit Rate/Frequency","Item Type Metadata:Time Summary","Item Type Metadata:Email Body","Item Type Metadata:Subject Line","Item Type Metadata:From","Item Type Metadata:To","Item Type Metadata:CC","Item Type Metadata:BCC","Item Type Metadata:Number of Attachments","Item Type Metadata:Standards","Item Type Metadata:Objectives","Item Type Metadata:Materials","Item Type Metadata:Lesson Plan Text","Item Type Metadata:URL","Item Type Metadata:Event Type","Item Type Metadata:Participants","Item Type Metadata:Birth Date","Item Type Metadata:Birthplace","Item Type Metadata:Death Date","Item Type Metadata:Occupation","Item Type Metadata:Biographical Text","Item Type Metadata:Bibliography",tags,file,itemType,collection,public,featured
"[Détail :] Hierosolymae veteris imago",,,,,,,,,,Plan,latin,"Gravure sur cuivre",PAT_18G_001_250c_Web,,,,,,,,,,,,,,,,,,,,,,,,,,,,,,,,,,,,"En médaillon,Jérusalem,Phylactère,Plan,Ville",https://hieronyma.ict-toulouse.fr/files/original/54dd90d91088446d3e36930328f1d489.JPG,,"L'Ancien et le Nouveau Testament représentés en cinq cens tableaux gravés d'après les desseins de Raphaël & autres grands maîtres et expliqués par les paroles de l'Ecriture",1,0
"[Plan géométrique de Persepolis]",,,,,,,,,,Planche,français,"Gravure sur cuivre",PAT_18P_280-9_003_web,,,,,,,,,,,,,,,,,,,,,,,,,,,,,,,,,,,,"Iran,Persépolis (ville ancienne),Plan",https://hieronyma.ict-toulouse.fr/files/original/fb1ce2037bd33e81cb0c9fd9c2a76d2c.jpg,,"Voyages de Mr. Le Chevalier Chardin, en Perse, et autres lieux de l'Orient. Tome Neuvième",1,0
"[Planche A pag. 1331 : Plan des colonnes soutenant le tilleul de Neuenstadt am Kocher]",,,,,,,,,,Planche,,"Gravure sur cuivre",PAT_17M_146_038_web,,,,,,,,,,,,,,,,,,,,,,,,,,,,,,,,,,,,"Allemagne,Colonne,Neuenstadt am Kocher,Plan",https://hieronyma.ict-toulouse.fr/files/original/dcccafb901096df7779c8ae33cf9f11b.JPG,"Image fixe","Physica curiosa",1,0
"Assur bâtit Ninive.",,,,,,,,,,"Image mi-page","français ; latin","Gravure sur cuivre",PAT_18G_001_017_web_a,,,,,,,,,,,,,,,,,,,,,,,,,,,,,,,,,,,,"Architecture urbaine,Assur (personnage biblique),Chantier,Compas,Construction,Livre de la Genèse,Maçonnerie,Ninive,Ombrelle,Plan,Ville",https://hieronyma.ict-toulouse.fr/files/original/718ce7f4d2990b8fb1d13678bfa65f6c.JPG,,"L'Ancien et le Nouveau Testament représentés en cinq cens tableaux gravés d'après les desseins de Raphaël & autres grands maîtres et expliqués par les paroles de l'Ecriture",1,0
"L'ancienne ville de Jesuralem & ses environs.",,,,,,,,,,Plan,français,"Gravure sur cuivre",PAT_18G_001_249_Web,,,,,,,,,,,,,,,,,,,,,,,,,,,,,,,,,,,,"Jardin des oliviers,Jérusalem,Le Temple,Plan,Ville,Vue d'architecture",https://hieronyma.ict-toulouse.fr/files/original/558406dce1d6d90f7dfad98f8e485d4a.JPG,,"L'Ancien et le Nouveau Testament représentés en cinq cens tableaux gravés d'après les desseins de Raphaël & autres grands maîtres et expliqués par les paroles de l'Ecriture",1,0
"Le Temple rebâti par Zorobabel et Esdras.",,,,,,,,,,"Image mi-page","français ; latin","Gravure sur cuivre",PAT_18G_001_154b,,,,,,,,,,,,,,,,,,,,,,,,,,,,,,,,,,,,"Chantier,Construction,Four,Le Temple,Livre d'Esdras,Maçonnerie,Ouvrier,Plan",https://hieronyma.ict-toulouse.fr/files/original/1824f77f245f07d7a0b0ee481b3433dc.JPG,,"L'Ancien et le Nouveau Testament représentés en cinq cens tableaux gravés d'après les desseins de Raphaël & autres grands maîtres et expliqués par les paroles de l'Ecriture",1,0
"Livre IV. Planche VI : [Exercices de cartographie]",,,,,,,,,,Planche,,"Gravure sur cuivre",PAT_18M_049_015_web,,,,,,,,,,,,,,,,,,,,,,,,,,,,,,,,,,,,"Carte,Figuration scientifique,Géométrie,Plan",https://hieronyma.ict-toulouse.fr/files/original/5690f8d6bcee3e2129919385fca3ab9b.JPG,"Image fixe","Geometrie élémentaire et pratique",1,0
"Livre V. Planche IX : [Réalisation d'un plan]",,,,,,,,,,Planche,,"Gravure sur cuivre",PAT_18M_049_031_web,,,,,,,,,,,,,,,,,,,,,,,,,,,,,,,,,,,,"Géométrie,Jardin,Maison,Plan",https://hieronyma.ict-toulouse.fr/files/original/85524c670b51a79b18f5c7deef9f4ce3.JPG,"Image fixe","Geometrie élémentaire et pratique",1,0
"N°20 : Ins. Macjan, Ins. Baetjan",,,,,,,,,,Planche,,"Gravure sur cuivre",RES_17P_003_037_web,,,,,,,,,,,,,,,,,,,,,,,,,,,,,,,,,,,,"Fortin,Île,Plan,Puits,Rempart,Ville",https://hieronyma.ict-toulouse.fr/files/original/da588fee4dca7340b1b979dba9d1eb9e.jpg,"Image fixe","Speculum orientalis occidentalisque Indiae navigationum [...]",1,0
"On travaille a l'arche, a la table, et au chandelier.",,,,,,,,,,"Image mi-page","français ; latin","Gravure sur cuivre",PAT_18G_001_066_web_a,,,,,,,,,,,,,,,,,,,,,,,,,,,,,,,,,,,,"Chantier,Construction,L'arche d'alliance,Livre de l'Exode,Menuiserie,Moïse,Orfèvrerie,Plan,Table",https://hieronyma.ict-toulouse.fr/files/original/8164bdbcf01627f342f81dee631072f5.JPG,,"L'Ancien et le Nouveau Testament représentés en cinq cens tableaux gravés d'après les desseins de Raphaël & autres grands maîtres et expliqués par les paroles de l'Ecriture",1,0
