﻿"Dublin Core:Title","Dublin Core:Subject","Dublin Core:Description","Dublin Core:Creator","Dublin Core:Source","Dublin Core:Publisher","Dublin Core:Date","Dublin Core:Contributor","Dublin Core:Rights","Dublin Core:Relation","Dublin Core:Format","Dublin Core:Language","Dublin Core:Type","Dublin Core:Identifier","Dublin Core:Coverage","Item Type Metadata:Text","Item Type Metadata:Interviewer","Item Type Metadata:Interviewee","Item Type Metadata:Location","Item Type Metadata:Transcription","Item Type Metadata:Local URL","Item Type Metadata:Original Format","Item Type Metadata:Physical Dimensions","Item Type Metadata:Duration","Item Type Metadata:Compression","Item Type Metadata:Producer","Item Type Metadata:Director","Item Type Metadata:Bit Rate/Frequency","Item Type Metadata:Time Summary","Item Type Metadata:Email Body","Item Type Metadata:Subject Line","Item Type Metadata:From","Item Type Metadata:To","Item Type Metadata:CC","Item Type Metadata:BCC","Item Type Metadata:Number of Attachments","Item Type Metadata:Standards","Item Type Metadata:Objectives","Item Type Metadata:Materials","Item Type Metadata:Lesson Plan Text","Item Type Metadata:URL","Item Type Metadata:Event Type","Item Type Metadata:Participants","Item Type Metadata:Birth Date","Item Type Metadata:Birthplace","Item Type Metadata:Death Date","Item Type Metadata:Occupation","Item Type Metadata:Biographical Text","Item Type Metadata:Bibliography",tags,file,itemType,collection,public,featured
[Bandeau],,,,,,,,,,"Ornement typographique",français,"Gravure sur bois",PAT_18G_002_038_web,,,,,,,,,,,,,,,,,,,,,,,,,,,,,,,,,,,,"Écureuil,Feuille,Insecte,Oiseau,Ornement à forme végétale,Plante,Putti,Vase de jardin",https://hieronyma.ict-toulouse.fr/files/original/68a2d04b7cbeba26abdf1839c6549d32.jpg,,"Ceremonies et coutumes religieuses de tous les peuples du monde..., 2",1,0
[Cul-de-lampe],,,,,,,,,,"Ornement typographique",,"Gravure sur bois",PAT_18G_002_037_web,,,,,,,,,,,,,,,,,,,,,,,,,,,,,,,,,,,,"Fleur,Insecte,Oiseau,Ornement à forme végétale,Plante,Vase de jardin",https://hieronyma.ict-toulouse.fr/files/original/6c8634b6140d38af8ea20c237b69cab3.jpg,,"Ceremonies et coutumes religieuses de tous les peuples du monde..., 2",1,0
"Parabole de la semence.",,,,,,,,,,"Image mi-page","français ; latin","Gravure sur cuivre",PAT_18G_001_188a,,,,,,,,,,,,,,,,,,,,,,,,,,,,,,,,,,,,"Champ,Évangile selon saint Matthieu,Graine,Oiseau,Parabole,Parabole du semeur,Pierre,Semailles",https://hieronyma.ict-toulouse.fr/files/original/8b768ce941f863ba527bee0c83ead5ee.JPG,,"L'Ancien et le Nouveau Testament représentés en cinq cens tableaux gravés d'après les desseins de Raphaël & autres grands maîtres et expliqués par les paroles de l'Ecriture",1,0
"Sortie de l'Arche",,,,,,,,,,"Image mi-page","français ; latin","Gravure sur cuivre",PAT_18G_001_015_web_a,,,,,,,,,,,,,,,,,,,,,,,,,,,,,,,,,,,,"Animal,Arche de Noé,Famille,Livre de la Genèse,Noé,Oiseau",https://hieronyma.ict-toulouse.fr/files/original/409a4e6240c662980f74996d32c82a80.JPG,,"L'Ancien et le Nouveau Testament représentés en cinq cens tableaux gravés d'après les desseins de Raphaël & autres grands maîtres et expliqués par les paroles de l'Ecriture",1,0
"Dieu cree les animaux de l'air et ceux des eaux",,,,,,,,,,"Image mi-page","français ; latin","Gravure sur cuivre",PAT_18G_001_005_web_b,,,,,,,,,,,,,,,,,,,,,,,,,,,,,,,,,,,,"Créateur,Dieu le Père,En vol,Livre de la Genèse,Mer,Oiseau,Paon,Poisson",https://hieronyma.ict-toulouse.fr/files/original/081ad480a379f126c3df3d7a06491b41.JPG,,"L'Ancien et le Nouveau Testament représentés en cinq cens tableaux gravés d'après les desseins de Raphaël & autres grands maîtres et expliqués par les paroles de l'Ecriture",1,0
"[La vision de saint Pierre]",,,,,,,,,,Vignette,latin,"Gravure sur bois",PAT_16M_022_412_web,,,,,,,,,,,,,,,,,,,,,,,,,,,,,,,,,,,,"Actes des Apôtres,Ange,Animal,Dieu le Père,Oiseau,Saint Pierre,Serpent,Sommeil,Tissu,Vision",https://hieronyma.ict-toulouse.fr/files/original/0a66b760929789a2e79af65956874ce0.jpg,,"[Bible, latin, 1574]",1,0
"[Le repas chez Simon. La parabole du semeur]",,,,,,,,,,Vignettes,latin,"Gravure sur bois",PAT_16M_022_365_web,,,,,,,,,,,,,,,,,,,,,,,,,,,,,,,,,,,,"Champ,Christ,Évangile selon saint Luc,Ferme,Graine,Oiseau,Panier,Parabole,Parabole du semeur,Parfum,Repas,Repas chez Simon,Sainte Madeleine,Semailles",https://hieronyma.ict-toulouse.fr/files/original/a064e761b31965fa66f3c400a8a549a8.jpg,,"[Bible, latin, 1574]",1,0
"[La parabole du semeur]",,,,,,,,,,Vignette,latin,"Gravure sur bois",PAT_16M_022_336_web,,,,,,,,,,,,,,,,,,,,,,,,,,,,,,,,,,,,"Blé,Champ,Évangile selon saint Marc,Graine,Oiseau,Panier,Parabole,Parabole du semeur,Semailles",https://hieronyma.ict-toulouse.fr/files/original/d45f2f070172de220de84d11088e17fb.jpg,,"[Bible, latin, 1574]",1,0
"[Jésus enseignant. La parabole du semeur. Le bon grain et l'ivraie]",,,,,,,,,,Vignettes,latin,"Gravure sur bois",PAT_16M_022_312_web,,,,,,,,,,,,,,,,,,,,,,,,,,,,,,,,,,,,"Bateau,Champ,Christ,Christ enseignant,Évangile selon saint Matthieu,Foule,Le bon grain et l'ivraie,Oiseau,Parabole,Parabole du semeur,Pêche,Pêcheur,Rive,Satan,Semailles,Sommeil",https://hieronyma.ict-toulouse.fr/files/original/944790eff87d38f8140023eb64b7cb82.jpg,,"[Bible, latin, 1574]",1,0
"Oiseaux, pl. 12",,,,,,,,,,Planche,,,planches_005_web,,,,,,,,,,,,,,,,,,,,,,,,,,,,,,,,,,,,"Animal,JEP2017,Oiseau,Planche zoologique,Rapace,Zoologie",https://hieronyma.ict-toulouse.fr/files/original/717e3942c48654b5f24cf28b7008ec8b.JPG,"Image fixe","Description de l'Egypte",1,0
