﻿"Dublin Core:Title","Dublin Core:Subject","Dublin Core:Description","Dublin Core:Creator","Dublin Core:Source","Dublin Core:Publisher","Dublin Core:Date","Dublin Core:Contributor","Dublin Core:Rights","Dublin Core:Relation","Dublin Core:Format","Dublin Core:Language","Dublin Core:Type","Dublin Core:Identifier","Dublin Core:Coverage","Item Type Metadata:Text","Item Type Metadata:Interviewer","Item Type Metadata:Interviewee","Item Type Metadata:Location","Item Type Metadata:Transcription","Item Type Metadata:Local URL","Item Type Metadata:Original Format","Item Type Metadata:Physical Dimensions","Item Type Metadata:Duration","Item Type Metadata:Compression","Item Type Metadata:Producer","Item Type Metadata:Director","Item Type Metadata:Bit Rate/Frequency","Item Type Metadata:Time Summary","Item Type Metadata:Email Body","Item Type Metadata:Subject Line","Item Type Metadata:From","Item Type Metadata:To","Item Type Metadata:CC","Item Type Metadata:BCC","Item Type Metadata:Number of Attachments","Item Type Metadata:Standards","Item Type Metadata:Objectives","Item Type Metadata:Materials","Item Type Metadata:Lesson Plan Text","Item Type Metadata:URL","Item Type Metadata:Event Type","Item Type Metadata:Participants","Item Type Metadata:Birth Date","Item Type Metadata:Birthplace","Item Type Metadata:Death Date","Item Type Metadata:Occupation","Item Type Metadata:Biographical Text","Item Type Metadata:Bibliography",tags,file,itemType,collection,public,featured
"[David ramène l'Arche d'Alliance à Jérusalem]",,,,,,,,,,"Pleine page",,"Gravure sur bois",PAT_16M_022_174_web,,,,,,,,,,,,,,,,,,,,,,,,,,,,,,,,,,,,"Boeuf,Char,David,Deuxième livre de Samuel,Harpe,L'arche d'alliance,Mort,Musicien,Musique,Procession,Punition,Roi,Trompe",https://hieronyma.ict-toulouse.fr/files/original/c84a9ce877d5d19c88bb6fc6bcec7b95.jpg,"Image fixe","[Bible, latin, 1574]",1,0
"[David décapite Goliath. Le retour triomphal de David]",,,,,,,,,,"Pleine page",,"Gravure sur bois",PAT_16M_022_161_web,,,,,,,,,,,,,,,,,,,,,,,,,,,,,,,,,,,,"Armée,Bâton,Cadavre,Cavalier,Danse,David,Décollation,Fronde,Fuite,Goliath,Musicien,Musique,Premier Livre de Samuel,Saül,Tambourin,Tente,Tête,Triomphe",https://hieronyma.ict-toulouse.fr/files/original/09bbeaf3aba3f3376d4411cbd1d1d6db.JPG,"Image fixe","[Bible, latin, 1574]",1,0
"[Marque de l'imprimeur Anton Hierat]",,,,,,,,,,"Marque d'imprimeur",,"Gravure sur bois",PAT_17_G_053_007_web,,,,,,,,,,,,,,,,,,,,,,,,,,,,,,,,,,,,"Animal fabuleux,Cigogne,Hippocampe,Licorne,Musicien,Putti,Serpent",https://hieronyma.ict-toulouse.fr/files/original/3ef7ae276866dedd5e02fe0f255aec11.jpg,"Image fixe","Commentariorum et disputationum",1,0
"[Lettre A]",,,,,,,,,,"Initiale ornée",,"Gravure sur bois",RES_16P_006_001_web,,,,,,,,,,,,,,,,,,,,,,,,,,,,,,,,,,,,"Être fabuleux,Lettre A,Musicien,Putti",https://hieronyma.ict-toulouse.fr/files/original/ee596bd1629c0be22d54039a68b17f01.jpg,"Image fixe",AntiLutherus,1,0
[Cul-de-lampe],,,,,,,,,,"Ornement typographique",,"Gravure sur bois",CAP_18P_084_026_web,,,,,,,,,,,,,,,,,,,,,,,,,,,,,,,,,,,,"Élément végétal,Enfant,Flûte,Musicien,Oiseau",https://hieronyma.ict-toulouse.fr/files/original/35d03038023282d2583b641687ee75e6.JPG,"Image fixe","La Santa infanzia di Gesu bambino",1,0
[Frontispice],,,,,,,,,,"Image pleine page",latin,"Gravure sur cuivre",PAT_17M_146_000_web,,,,,,,,,,,,,,,,,,,,,,,,,,,,,,,,,,,,"Animal,Arbre,Faune,Flûte à bec,Forêt,Mer,Musicien,Oiseau,Poisson,Rat,Salamandre,Sanglier,Singe,Sirène poisson,Taureau,Tête",https://hieronyma.ict-toulouse.fr/files/original/efe46104793877e6cb0c9b5150e120a6.JPG,"Image fixe","Physica curiosa",1,0
"La vie d'Esope.",,,,,,,,,,"Image mi-page",,"Gravure sur cuivre",PAT_17P_547_002_web,,,,,,,,,,,,,,,,,,,,,,,,,,,,,,,,,,,,"Bonnet,Castagnettes,Chute,Danse,Ésope,Fable,Falaise,Instrument à archet,Musicien,Musique,Peine de mort,Singe",https://hieronyma.ict-toulouse.fr/files/original/c33892caf3f5e604a0e702db7cd450bd.JPG,"Image fixe","Esope en belle humeur",1,1
"N°25 : Horn. Ins.",,,,,,,,,,Planche,,"Gravure sur cuivre",RES_17P_003_048_web,,,,,,,,,,,,,,,,,,,,,,,,,,,,,,,,,,,,"Barque,Bateau à voiles,Boisson,Hollandais,Hutte,Île,Îles de Horn,Montagne,Mort par arme à feu,Mousquet,Musicien,Océan Pacifique,Océanien,Préparation des aliments,Rencontre,Roi,Trompe,Wallis-et-Futuna",https://hieronyma.ict-toulouse.fr/files/original/4cd428bc095d925bd9d54b148ec79780.jpg,"Image fixe","Speculum orientalis occidentalisque Indiae navigationum [...]",1,1
"N°4 : La Mocha",,,,,,,,,,Planche,,"Gravure sur cuivre",RES_17P_003_006_web,,,,,,,,,,,,,,,,,,,,,,,,,,,,,,,,,,,,"Bateau à voiles,Chargement,Chili,Hollandais,Indien d'Amérique,Marine,Mocha (Ile),Mouton,Musicien,Océan Pacifique,Troc,Trompette,Village",https://hieronyma.ict-toulouse.fr/files/original/9c3e04243ebc5fe8e2951a6a968e2033.jpg,"Image fixe","Speculum orientalis occidentalisque Indiae navigationum [...]",1,0
"Jacobus de Valentia",,,,,,,,,,Vignette,,"Gravure sur bois",RES_16P_002_002_web,,,,,,,,,,,,,,,,,,,,,,,,,,,,,,,,,,,,"Ange,Annonciation,Auréole,Bibliothèque,Colombe,Croix,Écritoire,Évêque,Instrument à  cordes,Instrument à vent,Instrument d'écriture,Intérieur,Jaime Pérez de Valencia (1408-1490),Livre,Lys,Mitre,Musicien,Rayons lumineux,Saint,Saint Gabriel,Saint-Esprit,Vierge",https://hieronyma.ict-toulouse.fr/files/original/9151e8c5bac922714d50d41f35edde20.JPG,"Image fixe","D. Jacobi Perem de Valentia divine plane espositiones in psalmos Davidicos",1,1
