﻿"Dublin Core:Title","Dublin Core:Subject","Dublin Core:Description","Dublin Core:Creator","Dublin Core:Source","Dublin Core:Publisher","Dublin Core:Date","Dublin Core:Contributor","Dublin Core:Rights","Dublin Core:Relation","Dublin Core:Format","Dublin Core:Language","Dublin Core:Type","Dublin Core:Identifier","Dublin Core:Coverage","Item Type Metadata:Text","Item Type Metadata:Interviewer","Item Type Metadata:Interviewee","Item Type Metadata:Location","Item Type Metadata:Transcription","Item Type Metadata:Local URL","Item Type Metadata:Original Format","Item Type Metadata:Physical Dimensions","Item Type Metadata:Duration","Item Type Metadata:Compression","Item Type Metadata:Producer","Item Type Metadata:Director","Item Type Metadata:Bit Rate/Frequency","Item Type Metadata:Time Summary","Item Type Metadata:Email Body","Item Type Metadata:Subject Line","Item Type Metadata:From","Item Type Metadata:To","Item Type Metadata:CC","Item Type Metadata:BCC","Item Type Metadata:Number of Attachments","Item Type Metadata:Standards","Item Type Metadata:Objectives","Item Type Metadata:Materials","Item Type Metadata:Lesson Plan Text","Item Type Metadata:URL","Item Type Metadata:Event Type","Item Type Metadata:Participants","Item Type Metadata:Birth Date","Item Type Metadata:Birthplace","Item Type Metadata:Death Date","Item Type Metadata:Occupation","Item Type Metadata:Biographical Text","Item Type Metadata:Bibliography",tags,file,itemType,collection,public,featured
"[Samuel exécute Agag]",,,,,,,,,,"Pleine page",,"Gravure sur bois",PAT_16M_022_158_web,,,,,,,,,,,,,,,,,,,,,,,,,,,,,,,,,,,,"Agag,Couronne,Mort par le fer,Peine de mort,Premier Livre de Samuel,Roi,Samuel,Saül",https://hieronyma.ict-toulouse.fr/files/original/1298280589de6c2a740aa82eb4f14752.JPG,"Image fixe","[Bible, latin, 1574]",1,0
"[Saül fait tuer le prêtre Ahimélek et les autres prêtres de Nob]",,,,,,,,,,"Pleine page",,"Gravure sur bois",PAT_16M_022_165_web,,,,,,,,,,,,,,,,,,,,,,,,,,,,,,,,,,,,"Ahimélek,Meurtre,Mort par le fer,Ordre,Premier Livre de Samuel,Prêtre,Saül,Serviteur,Tente",https://hieronyma.ict-toulouse.fr/files/original/c42078fadee40c5eea456abc9051b5a5.JPG,"Image fixe","[Bible, latin, 1574]",1,0
"[Suicide de Saül]",,,,,,,,,,"Pleine page",,"Gravure sur bois",PAT_16M_022_169_web,,,,,,,,,,,,,,,,,,,,,,,,,,,,,,,,,,,,"Armée,Défaite,Mort par le fer,Premier Livre de Samuel,Saül,Serviteur,Suicide",https://hieronyma.ict-toulouse.fr/files/original/625923298e11c593168a4c5591c64e81.JPG,"Image fixe","[Bible, latin, 1574]",1,0
"[Zimri assassine le roi Ela]",,,,,,,,,,Vignette,,"Gravure sur bois",PAT_16M_022_201_web,,,,,,,,,,,,,,,,,,,,,,,,,,,,,,,,,,,,"Banquet,Ela,Guerre de siège,Incendie,Ivresse,Meurtre,Mort par le fer,Premier Livre des Rois,Roi,Zimri",https://hieronyma.ict-toulouse.fr/files/original/d1038a8899f86fab89fb51a5762dfb5a.jpg,"Image fixe","[Bible, latin, 1574]",1,0
"Absalom fait tuer Ammon son frere.",,,,,,,,,,"Image mi-page","français ; latin","Gravure sur cuivre",PAT_18G_001_115_web_b,,,,,,,,,,,,,,,,,,,,,,,,,,,,,,,,,,,,"Absalon,Amnon,Banquet,Deuxième livre de Samuel,Meurtre,Mort par le fer",https://hieronyma.ict-toulouse.fr/files/original/397f0f127d6d013737939e003ad9b174.JPG,,"L'Ancien et le Nouveau Testament représentés en cinq cens tableaux gravés d'après les desseins de Raphaël & autres grands maîtres et expliqués par les paroles de l'Ecriture",1,0
"Absalon tué par Joab.",,,,,,,,,,"Image mi-page","français ; latin","Gravure sur cuivre",PAT_18G_001_116b,,,,,,,,,,,,,,,,,,,,,,,,,,,,,,,,,,,,"Absalon,Arbre,Cavalier,Cheveux,Deuxième livre de Samuel,Joab,Lance,Mort par le fer",https://hieronyma.ict-toulouse.fr/files/original/e311206d4a77a97b8363c4789af536e9.JPG,,"L'Ancien et le Nouveau Testament représentés en cinq cens tableaux gravés d'après les desseins de Raphaël & autres grands maîtres et expliqués par les paroles de l'Ecriture",1,0
"Agag mis en pieces par Samuel.",,,,,,,,,,"Image mi- page","français ; latin","Gravure sur cuivre",PAT_18G_001_102_web_b,,,,,,,,,,,,,,,,,,,,,,,,,,,,,,,,,,,,"Agag,Mort par le fer,Peine de mort,Premier Livre de Samuel,Roi,Samuel,Saül",https://hieronyma.ict-toulouse.fr/files/original/6e27346c98f6b28a8c6fdc3750bf705b.JPG,,"L'Ancien et le Nouveau Testament représentés en cinq cens tableaux gravés d'après les desseins de Raphaël & autres grands maîtres et expliqués par les paroles de l'Ecriture",1,0
Andromaque.,,,,,,,,,,Planche,,"Gravure sur cuivre",PAT_18M_032-1_006_web,,,,,,,,,,,,,,,,,,,,,,,,,,,,,,,,,,,,"Andromaque,Autel,Intérieur,JEP2019,Mariage,Meurtre,Mort par le fer,Oreste,Pyrrhus,Temple",https://hieronyma.ict-toulouse.fr/files/original/f389467d6cfecc1dcda9fe5421f75f7b.jpg,"Image fixe","Oeuvres complètes de Jean Racine 1",1,1
"Aod Tue Eglon et delivre Israel",,,,,,,,,,"Image mi-page","français ; latin","Gravure sur cuivre",PAT_18G_001_087_web_a,,,,,,,,,,,,,,,,,,,,,,,,,,,,,,,,,,,,"Eglon,Éhoud,Livre des Juges,Meurtre,Mort par le fer,Roi",https://hieronyma.ict-toulouse.fr/files/original/3235f239c7b77bdf3d06d99fe8c3b19d.JPG,,"L'Ancien et le Nouveau Testament représentés en cinq cens tableaux gravés d'après les desseins de Raphaël & autres grands maîtres et expliqués par les paroles de l'Ecriture",1,0
"Combat des champions d'Isboseth et de David.",,,,,,,,,,Planche,,"Gravure sur acier",1133_SAI_1_078_web,,,,,,,,,,,,,,,,,,,,,,,,,,,,,,,,,,,,"Armée,Combat singulier,Deuxième livre de Samuel,Mort par le fer",https://hieronyma.ict-toulouse.fr/files/original/d9937c0be4bd11ccb7d0a95c2b920a86.JPG,"Image fixe","La Sainte Bible : traduction nouvelle selon la Vulgate",1,0
