﻿"Dublin Core:Title","Dublin Core:Subject","Dublin Core:Description","Dublin Core:Creator","Dublin Core:Source","Dublin Core:Publisher","Dublin Core:Date","Dublin Core:Contributor","Dublin Core:Rights","Dublin Core:Relation","Dublin Core:Format","Dublin Core:Language","Dublin Core:Type","Dublin Core:Identifier","Dublin Core:Coverage","Item Type Metadata:Text","Item Type Metadata:Interviewer","Item Type Metadata:Interviewee","Item Type Metadata:Location","Item Type Metadata:Transcription","Item Type Metadata:Local URL","Item Type Metadata:Original Format","Item Type Metadata:Physical Dimensions","Item Type Metadata:Duration","Item Type Metadata:Compression","Item Type Metadata:Producer","Item Type Metadata:Director","Item Type Metadata:Bit Rate/Frequency","Item Type Metadata:Time Summary","Item Type Metadata:Email Body","Item Type Metadata:Subject Line","Item Type Metadata:From","Item Type Metadata:To","Item Type Metadata:CC","Item Type Metadata:BCC","Item Type Metadata:Number of Attachments","Item Type Metadata:Standards","Item Type Metadata:Objectives","Item Type Metadata:Materials","Item Type Metadata:Lesson Plan Text","Item Type Metadata:URL","Item Type Metadata:Event Type","Item Type Metadata:Participants","Item Type Metadata:Birth Date","Item Type Metadata:Birthplace","Item Type Metadata:Death Date","Item Type Metadata:Occupation","Item Type Metadata:Biographical Text","Item Type Metadata:Bibliography",tags,file,itemType,collection,public,featured
"[Adam travaille la terre. Dieu favorise l'offrande d'Abel]",,,,,,,,,,"Pleine page",,"Gravure sur bois",PAT_16M_022_004_web,,,,,,,,,,,,,,,,,,,,,,,,,,,,,,,,,,,,"Abel,Adam,Allaitement,Allégorie,Autel,Caïn,Dieu le Père,Ève,Forêt,Fumée,Labour à bras,Livre de la Genèse,Mort,Nourrisson,Sacrifice,Squelette",https://hieronyma.ict-toulouse.fr/files/original/908a1dfc8554baea6dab44acd84c0d3d.jpg,"Image fixe","[Bible, latin, 1574]",1,0
"[David ramène l'Arche d'Alliance à Jérusalem]",,,,,,,,,,"Pleine page",,"Gravure sur bois",PAT_16M_022_174_web,,,,,,,,,,,,,,,,,,,,,,,,,,,,,,,,,,,,"Boeuf,Char,David,Deuxième livre de Samuel,Harpe,L'arche d'alliance,Mort,Musicien,Musique,Procession,Punition,Roi,Trompe",https://hieronyma.ict-toulouse.fr/files/original/c84a9ce877d5d19c88bb6fc6bcec7b95.jpg,"Image fixe","[Bible, latin, 1574]",1,0
"[Dieu envoie des lions massacrer les nouveaux habitants de la Samarie]",,,,,,,,,,Vignette,,"Gravure sur bois",PAT_16M_022_218_web,,,,,,,,,,,,,,,,,,,,,,,,,,,,,,,,,,,,"Agression animale,Deuxième Livre des Rois,Lion,Mort",https://hieronyma.ict-toulouse.fr/files/original/c6a121bd1726b5c5ce87ad30dde4453d.jpg,"Image fixe","[Bible, latin, 1574]",1,0
"[Dieu s'adresse à Samuel. Mort du grand-prêtre Éli]",,,,,,,,,,"Pleine page",,"Gravure sur bois",PAT_16M_022_150_web,,,,,,,,,,,,,,,,,,,,,,,,,,,,,,,,,,,,"Armée,Chute,Défaite,Dieu le Père,Éli,Extérieur,Intérieur,L'arche d'alliance,Messager,Mort,Nuit,Premier Livre de Samuel,Samuel,Temple,Voix",https://hieronyma.ict-toulouse.fr/files/original/f84a9fab31f1f9954bccfe617c1dd5d5.JPG,"Image fixe","[Bible, latin, 1574]",1,0
"[L'ouverture des sept sceaux. Les quatre cavaliers de l'Apocalypse]",,,,,,,,,,Vignettes,latin,"Gravure sur bois",PAT_16M_022_433_web,,,,,,,,,,,,,,,,,,,,,,,,,,,,,,,,,,,,"Allégorie,Ange,Arc,Balance,Cadavre,Cavalier,Damné,Dieu le Père,Épée,Famine,Flamme,Guerre de siège,La guerre,Lance,Lecture,Livre,Livre de l'Apocalypse,Mort,Soldat,Squelette,Vision",https://hieronyma.ict-toulouse.fr/files/original/b0a1d05b6b9a0c5827a6d76da1667515.jpg,,"[Bible, latin, 1574]",1,0
"[La maladie, le testament et la mort de Don Quichotte]",,,,,,,,,,Vignette,,"Gravure sur bois",S_1826_037_web,,,,,,,,,,,,,,,,,,,,,,,,,,,,,,,,,,,,"Don Quichotte,Legs,Mort",https://hieronyma.ict-toulouse.fr/files/original/56e8ec1f741ba0dca3a7396edba9fbd5.jpg,"Image fixe","Don Quichotte",1,0
"[Les Assyriens s'enfuient après la mort d'Holopherne]",,,,,,,,,,Vignette,,"Gravure sur bois",PAT_16M_022_247_web,,,,,,,,,,,,,,,,,,,,,,,,,,,,,,,,,,,,"Armée,Bataille,Holopherne,Livre de Judith,Mort,Poursuite militaire,Rempart,Tente,Tête,Trompe",https://hieronyma.ict-toulouse.fr/files/original/2498375562677dfdd44042c52c5a3a29.JPG,"Image fixe","[Bible, latin, 1574]",1,0
"[Les dix plaies d'Égypte : l'eau du Nil est changée en sang. Les Égyptiens creusent autour du Nil pour trouver de l'eau]",,,,,,,,,,"Pleine page",,"Gravure sur bois",PAT_16M_022_071_web,,,,,,,,,,,,,,,,,,,,,,,,,,,,,,,,,,,,"Aaron,Bâton,Bétail,Livre de l'Exode,Moïse,Mort,Nil,Pharaon,Poisson,Puits,Punition,Sang",https://hieronyma.ict-toulouse.fr/files/original/281c995df0c6cd363f243696826d7ff9.jpg,"Image fixe","[Bible, latin, 1574]",1,0
"[Les dix plaies d'Égypte : la peste bovine]",,,,,,,,,,"Pleine page",,"Gravure sur bois",PAT_16M_022_074_web,,,,,,,,,,,,,,,,,,,,,,,,,,,,,,,,,,,,"Bétail,Livre de l'Exode,Mort,Punition",https://hieronyma.ict-toulouse.fr/files/original/872d3738b5e4c786fc6fc0a69d9a49c2.jpg,"Image fixe","[Bible, latin, 1574]",1,0
"[Les dix plaies d'Égypte] Ve plaie mortalité sur les animaux",,,,,,,,,,"Image mi-page","français ; latin","Gravure sur cuivre",PAT_18G_001_055_web_b,,,,,,,,,,,,,,,,,,,,,,,,,,,,,,,,,,,,"Animal,Bétail,Étable,Livre de l'Exode,Mort",https://hieronyma.ict-toulouse.fr/files/original/18a1fb453115ee5304b26400e0711272.JPG,,"L'Ancien et le Nouveau Testament représentés en cinq cens tableaux gravés d'après les desseins de Raphaël & autres grands maîtres et expliqués par les paroles de l'Ecriture",1,0
