﻿"Dublin Core:Title","Dublin Core:Subject","Dublin Core:Description","Dublin Core:Creator","Dublin Core:Source","Dublin Core:Publisher","Dublin Core:Date","Dublin Core:Contributor","Dublin Core:Rights","Dublin Core:Relation","Dublin Core:Format","Dublin Core:Language","Dublin Core:Type","Dublin Core:Identifier","Dublin Core:Coverage","Item Type Metadata:Text","Item Type Metadata:Interviewer","Item Type Metadata:Interviewee","Item Type Metadata:Location","Item Type Metadata:Transcription","Item Type Metadata:Local URL","Item Type Metadata:Original Format","Item Type Metadata:Physical Dimensions","Item Type Metadata:Duration","Item Type Metadata:Compression","Item Type Metadata:Producer","Item Type Metadata:Director","Item Type Metadata:Bit Rate/Frequency","Item Type Metadata:Time Summary","Item Type Metadata:Email Body","Item Type Metadata:Subject Line","Item Type Metadata:From","Item Type Metadata:To","Item Type Metadata:CC","Item Type Metadata:BCC","Item Type Metadata:Number of Attachments","Item Type Metadata:Standards","Item Type Metadata:Objectives","Item Type Metadata:Materials","Item Type Metadata:Lesson Plan Text","Item Type Metadata:URL","Item Type Metadata:Event Type","Item Type Metadata:Participants","Item Type Metadata:Birth Date","Item Type Metadata:Birthplace","Item Type Metadata:Death Date","Item Type Metadata:Occupation","Item Type Metadata:Biographical Text","Item Type Metadata:Bibliography",tags,file,itemType,collection,public,featured
"[Mobilier biblique]",,"Réemploi de la gravure illustrant le chapitre XXVII du Livre de l'Exode",,,,,,,,"Pleine page",,"Gravure sur bois",PAT_16M_022_098_web,,,,,,,,,,,,,,,,,,,,,,,,,,,,,,,,,,,,"Autel,Lampe à huile,Livre de l'Exode,Mobilier biblique",https://hieronyma.ict-toulouse.fr/files/original/b7fa4cb06da145cd985dc500d11d0fbf.jpg,"Image fixe","[Bible, latin, 1574]",1,0
"[Moïse présente les Tables de la Loi aux Hébreux. Les Hébreux font des offrandes pour le Tabernacle]",,,,,,,,,,"Pleine page",,"Gravure sur bois",PAT_16M_022_106_web,,,,,,,,,,,,,,,,,,,,,,,,,,,,,,,,,,,,"Désigner,Les Tables de la Loi,Livre de l'Exode,Mobilier biblique,Moïse,Offrande,Tente",https://hieronyma.ict-toulouse.fr/files/original/99af635e393b7badcdbb5927d325b846.jpg,"Image fixe","[Bible, latin, 1574]",1,0
"[Vignettes illustrant le Livre de l'Exode]",,,,,,,,,,Vignette,,"Gravure sur cuivre",CAP_17G_046_007_web,,,,,,,,,,,,,,,,,,,,,,,,,,,,,,,,,,,,"Aaron,Apparition,Bâton,Char de guerre,Désert,Égypte,Encensoir,Esclavage,Fuite,Inondation,L'arche d'alliance,La manne,La Pâque,Les Tables de la Loi,Livre de l'Exode,Mer Rouge,Miracle,Mobilier biblique,Moïse,Mont Sinaï,Noyade,Or,Prière,Rayons lumineux,Repas,Roi,Soldat,Table,Tente,Trompe,Veau,Victoire",https://hieronyma.ict-toulouse.fr/files/original/759742969f2254b7829b18558012e06e.JPG,"Image fixe","La Sainte Bible",1,1
"Altare holocausti",,,,,,,,,,"Image mi-page",,"Gravure sur bois",PAT_16G_069_013_web,,,,,,,,,,,,,,,,,,,,,,,,,,,,,,,,,,,,"Autel,Bélier,Flamme,Fumée,Mobilier biblique,Sacrifice,Tête",https://hieronyma.ict-toulouse.fr/files/original/6e301dbc4b08bde9f14ee5aa5db91a37.jpg,"Image fixe","Biblia sacra Veteris et Novi Testamenti...",1,0
"Altera columnarum [...]. Descriptio maris, id est vasis [...]",,,,,,,,,,Vignette,,"Gravure sur bois",PAT_16M_022_192_web,,,,,,,,,,,,,,,,,,,,,,,,,,,,,,,,,,,,"Bassin,Boeuf,Colonne,Cour,Eau,Édifice biblique,Le Temple,Mer d'airain,Mobilier biblique,Premier Livre des Rois",https://hieronyma.ict-toulouse.fr/files/original/ce2c496db85dddb7999a7076131f8074.jpg,"Image fixe","[Bible, latin, 1574]",1,0
"Au J.er sacrifice Dieu envoye un feu qui consume l'holocauste.",,,,,,,,,,"Image mi-page","français ; latin","Gravure sur cuivre",PAT_18G_001_073_web_a,,,,,,,,,,,,,,,,,,,,,,,,,,,,,,,,,,,,"Autel,Dieu le Père,Feu,Le Tabernacle,Livre du Lévitique,Mobilier biblique,Rayons lumineux,Sacrifice",https://hieronyma.ict-toulouse.fr/files/original/084e9fa61ef26d9414ad600776b78f21.JPG,,"L'Ancien et le Nouveau Testament représentés en cinq cens tableaux gravés d'après les desseins de Raphaël & autres grands maîtres et expliqués par les paroles de l'Ecriture",1,0
"Autel des holocaustes, cuve d'airain.",,,,,,,,,,"Image mi-page","français ; latin","Gravure sur cuivre",PAT_18G_001_069_web_a,,,,,,,,,,,,,,,,,,,,,,,,,,,,,,,,,,,,"Autel,Fontaine,Livre de l'Exode,Mobilier biblique,Sacrifice,Vase",https://hieronyma.ict-toulouse.fr/files/original/0be3db191833afa434aaa30b7e8f221f.JPG,,"L'Ancien et le Nouveau Testament représentés en cinq cens tableaux gravés d'après les desseins de Raphaël & autres grands maîtres et expliqués par les paroles de l'Ecriture",1,0
"Colonnes d'airain, autel et cuvier du temple de Salomon.",,,,,,,,,,"Image mi-page","français ; latin","Gravure sur cuivre",PAT_18G_001_120a,,,,,,,,,,,,,,,,,,,,,,,,,,,,,,,,,,,,"Autel,Bassin,Colonne,Le Temple,Mobilier biblique,Premier Livre des Rois",https://hieronyma.ict-toulouse.fr/files/original/f435224d5a2281ad7c997dcb07472bf0.JPG,,"L'Ancien et le Nouveau Testament représentés en cinq cens tableaux gravés d'après les desseins de Raphaël & autres grands maîtres et expliqués par les paroles de l'Ecriture",1,0
"Consecration d'Aaron et de ses fils.",,,,,,,,,,"Image mi-page","français ; latin","Gravure sur cuivre",PAT_18G_001_072_web_b,,,,,,,,,,,,,,,,,,,,,,,,,,,,,,,,,,,,"Désert,Le Tabernacle,Livre du Lévitique,Mobilier biblique",https://hieronyma.ict-toulouse.fr/files/original/9fe4a99d4b786eb0ba65fcc45ada78fc.JPG,,"L'Ancien et le Nouveau Testament représentés en cinq cens tableaux gravés d'après les desseins de Raphaël & autres grands maîtres et expliqués par les paroles de l'Ecriture",1,0
"Cortinae cherubinis sparsae / Saga cilicina",,,,,,,,,,"Image pleine page",,"Gravure sur bois",PAT_16G_069_010_web,,,,,,,,,,,,,,,,,,,,,,,,,,,,,,,,,,,,"Chérubin,Le Tabernacle,Mobilier biblique,Tente,Tête",https://hieronyma.ict-toulouse.fr/files/original/1da0c15b8c54a2bd38df5232135108f8.jpg,"Image fixe","Biblia sacra Veteris et Novi Testamenti...",1,0
