﻿"Dublin Core:Title","Dublin Core:Subject","Dublin Core:Description","Dublin Core:Creator","Dublin Core:Source","Dublin Core:Publisher","Dublin Core:Date","Dublin Core:Contributor","Dublin Core:Rights","Dublin Core:Relation","Dublin Core:Format","Dublin Core:Language","Dublin Core:Type","Dublin Core:Identifier","Dublin Core:Coverage","Item Type Metadata:Text","Item Type Metadata:Interviewer","Item Type Metadata:Interviewee","Item Type Metadata:Location","Item Type Metadata:Transcription","Item Type Metadata:Local URL","Item Type Metadata:Original Format","Item Type Metadata:Physical Dimensions","Item Type Metadata:Duration","Item Type Metadata:Compression","Item Type Metadata:Producer","Item Type Metadata:Director","Item Type Metadata:Bit Rate/Frequency","Item Type Metadata:Time Summary","Item Type Metadata:Email Body","Item Type Metadata:Subject Line","Item Type Metadata:From","Item Type Metadata:To","Item Type Metadata:CC","Item Type Metadata:BCC","Item Type Metadata:Number of Attachments","Item Type Metadata:Standards","Item Type Metadata:Objectives","Item Type Metadata:Materials","Item Type Metadata:Lesson Plan Text","Item Type Metadata:URL","Item Type Metadata:Event Type","Item Type Metadata:Participants","Item Type Metadata:Birth Date","Item Type Metadata:Birthplace","Item Type Metadata:Death Date","Item Type Metadata:Occupation","Item Type Metadata:Biographical Text","Item Type Metadata:Bibliography",tags,file,itemType,collection,public,featured
"Soleil arresté par Josué",,,,,,,,,,"Image mi-page","français ; latin","Gravure sur cuivre",PAT_18G_001_084_web_b,,,,,,,,,,,,,,,,,,,,,,,,,,,,,,,,,,,,"Bataille,Josué,Livre de Josué,Lune,Miracle,Mort par le fer,Soleil,Victoire",https://hieronyma.ict-toulouse.fr/files/original/075a11b9633f41f604670b4d4fb88df4.JPG,,"L'Ancien et le Nouveau Testament représentés en cinq cens tableaux gravés d'après les desseins de Raphaël & autres grands maîtres et expliqués par les paroles de l'Ecriture",1,0
"Prise de Jericho par Josué",,,,,,,,,,"Image mi-page","français ; latin","Gravure sur cuivre",PAT_18G_001_083_web_b,,,,,,,,,,,,,,,,,,,,,,,,,,,,,,,,,,,,"Destruction,Jéricho,Josué,L'arche d'alliance,Livre de Josué,Procession,Rempart",https://hieronyma.ict-toulouse.fr/files/original/2ec2754f80f8f4ebf2d53754095e294d.JPG,,"L'Ancien et le Nouveau Testament représentés en cinq cens tableaux gravés d'après les desseins de Raphaël & autres grands maîtres et expliqués par les paroles de l'Ecriture",1,0
"Passage du Jourdain par les Hébreux.",,,,,,,,,,Planche,,"Gravure sur acier",1133_SAI_1_044_web,,,,,,,,,,,,,,,,,,,,,,,,,,,,,,,,,,,,"Armée,Fleuve,Jourdain,Livre de Josué",https://hieronyma.ict-toulouse.fr/files/original/5400bb4f0effcee10a4b1962b780c80f.JPG,"Image fixe","La Sainte Bible : traduction nouvelle selon la Vulgate",1,0
"Passage du Jourdain par le peuple d'Israel",,,,,,,,,,"Image mi-page","français ; latin","Gravure sur cuivre",PAT_18G_001_082_web_b,,,,,,,,,,,,,,,,,,,,,,,,,,,,,,,,,,,,"Fleuve,Gué,Jourdain,L'arche d'alliance,Livre de Josué,Mobilier biblique,Prêtre,Soldat",https://hieronyma.ict-toulouse.fr/files/original/b537411a0887e4961e2eb436c2f601c7.JPG,,"L'Ancien et le Nouveau Testament représentés en cinq cens tableaux gravés d'après les desseins de Raphaël & autres grands maîtres et expliqués par les paroles de l'Ecriture",1,0
"Partage de la terre de Chanaan",,,,,,,,,,"Image mi-page","français ; latin","Gravure sur cuivre",PAT_18G_001_085_web_a,,,,,,,,,,,,,,,,,,,,,,,,,,,,,,,,,,,,"Eléazar,Josué,Livre de Josué,Partage,Prêtre,Roi",https://hieronyma.ict-toulouse.fr/files/original/2f038c62937dc92a2861b81cc6fc8c3c.JPG,,"L'Ancien et le Nouveau Testament représentés en cinq cens tableaux gravés d'après les desseins de Raphaël & autres grands maîtres et expliqués par les paroles de l'Ecriture",1,0
"Les murs de Jéricho renversés.",,,,,,,,,,Planche,,"Gravure sur acier",1133_SAI_1_045_web,,,,,,,,,,,,,,,,,,,,,,,,,,,,,,,,,,,,"Chute,Jéricho,L'arche d'alliance,Livre de Josué,Mort,Mur,Prêtre,Procession,Trompe",https://hieronyma.ict-toulouse.fr/files/original/a875318d8205ae662165ccb4fcda0bfd.JPG,"Image fixe","La Sainte Bible : traduction nouvelle selon la Vulgate",1,0
"Le prince de l'armée du seigneur apparoist a Josue",,,,,,,,,,"Image mi-page","français ; latin","Gravure sur cuivre",PAT_18G_001_083_web_a,,,,,,,,,,,,,,,,,,,,,,,,,,,,,,,,,,,,"Agenouillé,Ange,Apparition,Armée,Jéricho,Josué,Livre de Josué",https://hieronyma.ict-toulouse.fr/files/original/0c8426fc65c18b8f537d30693fae7990.JPG,,"L'Ancien et le Nouveau Testament représentés en cinq cens tableaux gravés d'après les desseins de Raphaël & autres grands maîtres et expliqués par les paroles de l'Ecriture",1,0
"L'armée des Amorrhéens détruite par une grêle de pierres.",,,,,,,,,,Planche,,"Gravure sur acier",1133_SAI_1_049_web,,,,,,,,,,,,,,,,,,,,,,,,,,,,,,,,,,,,"Armée,Destruction,Grêle,Livre de Josué,Miracle,Pierre",https://hieronyma.ict-toulouse.fr/files/original/b7f43327ea308c9a6046d3af5cf1df21.JPG,"Image fixe","La Sainte Bible : traduction nouvelle selon la Vulgate",1,0
"Josué renouvelle l'alliance avec Dieu.",,,,,,,,,,"Image mi-page","français ; latin","Gravure sur cuivre",PAT_18G_001_086_web_a,,,,,,,,,,,,,,,,,,,,,,,,,,,,,,,,,,,,"Chêne,Josué,Livre de Josué,Pierre,Sichem",https://hieronyma.ict-toulouse.fr/files/original/e887ab307dcbe344513a644feeabd7ff.JPG,,"L'Ancien et le Nouveau Testament représentés en cinq cens tableaux gravés d'après les desseins de Raphaël & autres grands maîtres et expliqués par les paroles de l'Ecriture",1,0
"Josué livre aux flammes la ville d'Haï.",,,,,,,,,,Planche,,"Gravure sur acier",1133_SAI_1_048_web,,,,,,,,,,,,,,,,,,,,,,,,,,,,,,,,,,,,"Aï (ville),Armée,Fumée,Incendie,Livre de Josué",https://hieronyma.ict-toulouse.fr/files/original/cb8c45859fe3f7ce9dd511a47be99378.JPG,"Image fixe","La Sainte Bible : traduction nouvelle selon la Vulgate",1,0
