﻿"Dublin Core:Title","Dublin Core:Subject","Dublin Core:Description","Dublin Core:Creator","Dublin Core:Source","Dublin Core:Publisher","Dublin Core:Date","Dublin Core:Contributor","Dublin Core:Rights","Dublin Core:Relation","Dublin Core:Format","Dublin Core:Language","Dublin Core:Type","Dublin Core:Identifier","Dublin Core:Coverage","Item Type Metadata:Text","Item Type Metadata:Interviewer","Item Type Metadata:Interviewee","Item Type Metadata:Location","Item Type Metadata:Transcription","Item Type Metadata:Local URL","Item Type Metadata:Original Format","Item Type Metadata:Physical Dimensions","Item Type Metadata:Duration","Item Type Metadata:Compression","Item Type Metadata:Producer","Item Type Metadata:Director","Item Type Metadata:Bit Rate/Frequency","Item Type Metadata:Time Summary","Item Type Metadata:Email Body","Item Type Metadata:Subject Line","Item Type Metadata:From","Item Type Metadata:To","Item Type Metadata:CC","Item Type Metadata:BCC","Item Type Metadata:Number of Attachments","Item Type Metadata:Standards","Item Type Metadata:Objectives","Item Type Metadata:Materials","Item Type Metadata:Lesson Plan Text","Item Type Metadata:URL","Item Type Metadata:Event Type","Item Type Metadata:Participants","Item Type Metadata:Birth Date","Item Type Metadata:Birthplace","Item Type Metadata:Death Date","Item Type Metadata:Occupation","Item Type Metadata:Biographical Text","Item Type Metadata:Bibliography",tags,file,itemType,collection,public,featured
"Benediction d'Esau",,,,,,,,,,"Image mi-page","français ; latin","Gravure sur cuivre",PAT_18G_001_032_web_a,,,,,,,,,,,,,,,,,,,,,,,,,,,,,,,,,,,,"Aveugle,Bénédiction,Dépouille,Ésaü,Isaac,Jacob,Lit,Livre de la Genèse,Rébecca",https://hieronyma.ict-toulouse.fr/files/original/53fe8b0a15270a69084058ed90cb4473.JPG,,"L'Ancien et le Nouveau Testament représentés en cinq cens tableaux gravés d'après les desseins de Raphaël & autres grands maîtres et expliqués par les paroles de l'Ecriture",1,0
"Isaac Benit Jacob.",,,,,,,,,,"Image mi-page","français ; latin","Gravure sur cuivre",PAT_18G_001_031_web_b,,,,,,,,,,,,,,,,,,,,,,,,,,,,,,,,,,,,"Aveugle,Bénédiction,Ésaü,Isaac,Jacob,Lit,Livre de la Genèse,Rébecca,Trahison",https://hieronyma.ict-toulouse.fr/files/original/b5978e4ccc8ecd161a79fe2813202849.JPG,,"L'Ancien et le Nouveau Testament représentés en cinq cens tableaux gravés d'après les desseins de Raphaël & autres grands maîtres et expliqués par les paroles de l'Ecriture",1,0
"Abraham meurt.",,,,,,,,,,"Image mi-page","français ; latin","Gravure sur cuivre",PAT_18G_001_028_web_a,,,,,,,,,,,,,,,,,,,,,,,,,,,,,,,,,,,,"Abraham,Deuil,Famille,Lit,Livre de la Genèse,Mort",https://hieronyma.ict-toulouse.fr/files/original/1af4bcd1a6e69939c156916141acf60d.JPG,,"L'Ancien et le Nouveau Testament représentés en cinq cens tableaux gravés d'après les desseins de Raphaël & autres grands maîtres et expliqués par les paroles de l'Ecriture",1,0
"Liv. 17 : Telemaque apporte à Phalante blessé les cendres de son frere Hippias tué dans le Combat.",,,,,,,,,,Planche,français,"Gravure sur cuivre",FD_487-2_005_web,,,,,,,,,,,,,,,,,,,,,,,,,,,,,,,,,,,,"Blessé,Intérieur,Lit,Objet funéraire,Soldat,Télémaque,Tente,Urne funéraire",https://hieronyma.ict-toulouse.fr/files/original/e7afe1e4d39cc8b4e44f283001c711ac.jpg,,"Les aventures de Télémaque, fils d'Ulysse",1,0
"Résurrection de la fille de Jaïre",,,,,,,,,,Planche,,"Gravure sur acier",1133_SAI_2_053_web,,,,,,,,,,,,,,,,,,,,,,,,,,,,,,,,,,,,"Chambre,Christ,Évangile selon saint Luc,Intérieur,Jésus ressuscitant,Lit,Miracle du Christ,Résurrection de la fille de Jaïre,Saint Jacques le Majeur,Saint Jean,Saint Pierre",https://hieronyma.ict-toulouse.fr/files/original/6c1f0b0b398571c9ad83c650d316835a.JPG,,"La Sainte Bible : traduction nouvelle selon la Vulgate",1,0
"Les Bonnes Œuvres",,,,,,,,,,"Image pleine page",,"Gravure sur cuivre",PAT_17P_618_008_web,,,,,,,,,,,,,,,,,,,,,,,,,,,,,,,,,,,,"Allégorie,Archange,Blé,Cardinal,Chandelle,Charité,Christ,Dauphin,Enfant,Étoile,François de Joyeuse,Globe,Joseph,Lampe à huile,Lit,Livre de l'Apocalypse,Louis XIII,Mammifère marin,Objet du culte,Pharaon,Prêtre,Saint Raphaël,Songe,Tobie,Tobit,Trompe,Vache",https://hieronyma.ict-toulouse.fr/files/original/6d8bf122ead489569d8cf52335dbe4bd.jpg,"Image fixe","Catechisme Royal",1,1
"La Foy",,,,,,,,,,"Image pleine page",,"Gravure sur cuivre",PAT_17P_618_001_web,,,,,,,,,,,,,,,,,,,,,,,,,,,,,,,,,,,,"Abraham,Agenouillé,Allégorie,Ange,Chameau,Eau,Femme,Foi,Isaac,Lit,Mammifère marin,Miroir,Puits,Sacrifice,Tente",https://hieronyma.ict-toulouse.fr/files/original/585f2e559d2b46999206451429859968.jpg,"Image fixe","Catechisme Royal",1,0
"[Judith en prière]",,,,,,,,,,Vignette,,"Gravure sur bois",PAT_16M_022_245_web,,,,,,,,,,,,,,,,,,,,,,,,,,,,,,,,,,,,"Agenouillé,Autel,Chambre,Intérieur,Judith,Lit,Livre,Livre de Judith,Prière,Serviteur",https://hieronyma.ict-toulouse.fr/files/original/367bb9fc5b2de763ef4d55bf56189bab.JPG,"Image fixe","[Bible, latin, 1574]",1,0
"[Assassinat du roi Joas de Juda]",,,,,,,,,,Vignette,,"Gravure sur bois",PAT_16M_022_234_web,,,,,,,,,,,,,,,,,,,,,,,,,,,,,,,,,,,,"Deuxième Livre des Chroniques,Joas de Juda,Lit,Meurtre,Mort par le fer,Nudité,Nuit,Poignard,Serviteur,Torche",https://hieronyma.ict-toulouse.fr/files/original/1de1d5e4b3f4ce725a3a146c24142bb6.jpg,"Image fixe","[Bible, latin, 1574]",1,0
"[Isaïe prolonge la vie du roi Ezéchias]",,,,,,,,,,Vignette,,"Gravure sur bois",PAT_16M_022_222_web,,,,,,,,,,,,,,,,,,,,,,,,,,,,,,,,,,,,"Chambre,Deuxième Livre des Rois,Ézéchias,Guérison miraculeuse,Intérieur,Isaïe,Lit,Roi",https://hieronyma.ict-toulouse.fr/files/original/db773503771b40111c6b9699e622d284.jpg,"Image fixe","[Bible, latin, 1574]",1,0
