﻿"Dublin Core:Title","Dublin Core:Subject","Dublin Core:Description","Dublin Core:Creator","Dublin Core:Source","Dublin Core:Publisher","Dublin Core:Date","Dublin Core:Contributor","Dublin Core:Rights","Dublin Core:Relation","Dublin Core:Format","Dublin Core:Language","Dublin Core:Type","Dublin Core:Identifier","Dublin Core:Coverage","Item Type Metadata:Text","Item Type Metadata:Interviewer","Item Type Metadata:Interviewee","Item Type Metadata:Location","Item Type Metadata:Transcription","Item Type Metadata:Local URL","Item Type Metadata:Original Format","Item Type Metadata:Physical Dimensions","Item Type Metadata:Duration","Item Type Metadata:Compression","Item Type Metadata:Producer","Item Type Metadata:Director","Item Type Metadata:Bit Rate/Frequency","Item Type Metadata:Time Summary","Item Type Metadata:Email Body","Item Type Metadata:Subject Line","Item Type Metadata:From","Item Type Metadata:To","Item Type Metadata:CC","Item Type Metadata:BCC","Item Type Metadata:Number of Attachments","Item Type Metadata:Standards","Item Type Metadata:Objectives","Item Type Metadata:Materials","Item Type Metadata:Lesson Plan Text","Item Type Metadata:URL","Item Type Metadata:Event Type","Item Type Metadata:Participants","Item Type Metadata:Birth Date","Item Type Metadata:Birthplace","Item Type Metadata:Death Date","Item Type Metadata:Occupation","Item Type Metadata:Biographical Text","Item Type Metadata:Bibliography",tags,file,itemType,collection,public,featured
"[Marque de l'imprimeur Jacques Giunta (1486-1546)]",,,,,,,,,,"Marque d'imprimeur",,"Gravure sur bois",RES_16P_009-1_004_web,,,,,,,,,,,,,,,,,,,,,,,,,,,,,,,,,,,,"Arbre,Fleur de lys,Initiale,Lion",https://hieronyma.ict-toulouse.fr/files/original/02f8a9fbeff3fbcac6690c5c004a943d.jpg,"Image fixe","Decisiones Capelle Tholose",1,0
"[Mort du prophète revenant de Béthel]",,,,,,,,,,Vignette,,"Gravure sur bois",PAT_16M_022_198_web,,,,,,,,,,,,,,,,,,,,,,,,,,,,,,,,,,,,"Agression animale,Âne,Cadavre,Lion,Premier Livre des Rois,Prophète,Ruines",https://hieronyma.ict-toulouse.fr/files/original/6bcd5bdb3380d507150e679f37f4d074.jpg,"Image fixe","[Bible, latin, 1574]",1,0
"[Page de titre]",,,,,,,,,,"Pleine page",,"Gravure sur bois",PAT_16M_022_000_web,,,,,,,,,,,,,,,,,,,,,,,,,,,,,,,,,,,,"Aaron,Abel,Abraham,Caïn,Créateur,Décor d'architecture,Dieu le Père,Étoile,Isaac,Les Évangelistes,Les Tables de la Loi,Lion,Lune,Meurtre,Moïse,Sacrifice,Saint Jérôme de Stridon,Soleil",https://hieronyma.ict-toulouse.fr/files/original/f438c9089c36ad23468336ab59187c3b.jpg,"Image fixe","[Bible, latin, 1574]",1,0
"[Page liminaire historiée]",,,,,,,,,,Vignette,,"Gravure sur bois",S_1826_028_web,,,,,,,,,,,,,,,,,,,,,,,,,,,,,,,,,,,,"De profil,Don Quichotte,Dulcinée,En médaillon,Lion,Portrait,Sancho Panza",https://hieronyma.ict-toulouse.fr/files/original/cca94337071a637d006ec7aa949c6d0c.jpg,"Image fixe","Don Quichotte",1,0
"[Planche XLII : Lion]",,,,,,,,,,"Image pleine page",,"Gravure sur cuivre",PAT_17M_146_021_web,,,,,,,,,,,,,,,,,,,,,,,,,,,,,,,,,,,,"Animal,Félin,JEP2017,Lion",https://hieronyma.ict-toulouse.fr/files/original/b5a762fbd0d842475dd7820d4e087e66.JPG,"Image fixe","Physica curiosa",1,1
"[Portrait de Saint Jérôme de Stridon]",,,,,,,,,,"Image pleine page",,Enluminure,RES_17G_001_001_web,,,,,,,,,,,,,,,,,,,,,,,,,,,,,,,,,,,,"Arbre,Christ en croix,Crâne,I.N.R.I,La Croix,Lecture,Lion,Livre manuscrit,Saint Jérôme de Stridon",https://hieronyma.ict-toulouse.fr/files/original/019bc6082cbd41c07f7834ffe1d360e3.JPG,,"Livre des rois",1,0
"[Saint Jérôme de Stridon]",,,,,,,,,,Vignette,,"Gravure sur bois",PAT_18P_338_001_web,,,,,,,,,,,,,,,,,,,,,,,,,,,,,,,,,,,,"Chapeau,Crucifix,Intérieur,Lion,Livre,Prière,Saint Jérôme de Stridon,Savignac",https://hieronyma.ict-toulouse.fr/files/original/f42697d49ae3aa9fc564819750c387a9.jpg,"Image fixe","Nouveau livre d'Église à l'usage de Rome",1,1
"[Samson ouvre la gueule d'un lion. Samson boit l'eau qui jaillit de la mâchoire d'âne]",,,,,,,,,,"Pleine page",,"Gravure sur bois",PAT_16M_022_139_web,,,,,,,,,,,,,,,,,,,,,,,,,,,,,,,,,,,,"Âne,Boisson,Cadavre,Eau,Lion,Livre des Juges,Miracle,Mise à mort,Os d'animal,Samson",https://hieronyma.ict-toulouse.fr/files/original/4e1019a09805793e608db7b4e814d58a.jpg,"Image fixe","[Bible, latin, 1574]",1,0
"[Titre avec un décor d'architecture et les armoiries de la Confrérie des Pénitents bleus]",,"Mention dans le phylactère : ""Sana me, Domine""",,,,,,,,"Image pleine page","français moyen (ca. 1400-1600)",Enluminure,RES_17G_001_000_web,,,,,,,,,,,,,,,,,,,,,,,,,,,,,,,,,,,,"Armoiries,Décor d'architecture,Épine,Lion,Phylactère",https://hieronyma.ict-toulouse.fr/files/original/91b901d59bb9c66ccdcee6afb02dfb70.JPG,,"Livre des rois",1,0
"[Vision de Daniel : les quatre bêtes sortant de la mer]",,,,,,,,,,Vignette,,"Gravure sur bois",PAT_16M_022_267_web,,,,,,,,,,,,,,,,,,,,,,,,,,,,,,,,,,,,"Aile,Hybride,Lion,Livre de Daniel,Mer,Ours,Polycéphale,Vent,Vision,Zoomorphe",https://hieronyma.ict-toulouse.fr/files/original/dacceb7bca20b46116241907fa260db8.jpg,"Image fixe","[Bible, latin, 1574]",1,0
