﻿"Dublin Core:Title","Dublin Core:Subject","Dublin Core:Description","Dublin Core:Creator","Dublin Core:Source","Dublin Core:Publisher","Dublin Core:Date","Dublin Core:Contributor","Dublin Core:Rights","Dublin Core:Relation","Dublin Core:Format","Dublin Core:Language","Dublin Core:Type","Dublin Core:Identifier","Dublin Core:Coverage","Item Type Metadata:Text","Item Type Metadata:Interviewer","Item Type Metadata:Interviewee","Item Type Metadata:Location","Item Type Metadata:Transcription","Item Type Metadata:Local URL","Item Type Metadata:Original Format","Item Type Metadata:Physical Dimensions","Item Type Metadata:Duration","Item Type Metadata:Compression","Item Type Metadata:Producer","Item Type Metadata:Director","Item Type Metadata:Bit Rate/Frequency","Item Type Metadata:Time Summary","Item Type Metadata:Email Body","Item Type Metadata:Subject Line","Item Type Metadata:From","Item Type Metadata:To","Item Type Metadata:CC","Item Type Metadata:BCC","Item Type Metadata:Number of Attachments","Item Type Metadata:Standards","Item Type Metadata:Objectives","Item Type Metadata:Materials","Item Type Metadata:Lesson Plan Text","Item Type Metadata:URL","Item Type Metadata:Event Type","Item Type Metadata:Participants","Item Type Metadata:Birth Date","Item Type Metadata:Birthplace","Item Type Metadata:Death Date","Item Type Metadata:Occupation","Item Type Metadata:Biographical Text","Item Type Metadata:Bibliography",tags,file,itemType,collection,public,featured
"Premieres tables de la Loy",,,,,,,,,,"Image mi-page","français ; latin","Gravure sur cuivre",PAT_18G_001_063_web_a,,,,,,,,,,,,,,,,,,,,,,,,,,,,,,,,,,,,"Apparition,Dieu le Père,Fumée,Les Tables de la Loi,Livre de l'Exode,Moïse,Mont Sinaï,Trompette",https://hieronyma.ict-toulouse.fr/files/original/d5c7e53aa5312e83d2a8db9e0f7887b9.JPG,,"L'Ancien et le Nouveau Testament représentés en cinq cens tableaux gravés d'après les desseins de Raphaël & autres grands maîtres et expliqués par les paroles de l'Ecriture",1,0
"Moïse descend du Sinaï.",,,,,,,,,,Planche,,"Gravure sur acier",1133_SAI_1_039_web,,,,,,,,,,,,,,,,,,,,,,,,,,,,,,,,,,,,"Les Tables de la Loi,Livre de l'Exode,Moïse,Rayons lumineux",https://hieronyma.ict-toulouse.fr/files/original/635a327d38a97f1522758108d3fc7369.JPG,"Image fixe","La Sainte Bible : traduction nouvelle selon la Vulgate",1,0
"Les Pharisiens preschent aux autres une morale severe qu'ils ne pratiquent pas eux-memes",,,,,,,,,,"Image mi-page","français ; latin","Gravure sur cuivre",PAT_18G_001_195b,,,,,,,,,,,,,,,,,,,,,,,,,,,,,,,,,,,,"Estrade,Évangile selon saint Matthieu,Foule,Hypocrisie,Lecture,Les Tables de la Loi,Prédication,Prêtre,Rouleau",https://hieronyma.ict-toulouse.fr/files/original/f093396db751d6c3ccc0ad3796a78424.JPG,,"L'Ancien et le Nouveau Testament représentés en cinq cens tableaux gravés d'après les desseins de Raphaël & autres grands maîtres et expliqués par les paroles de l'Ecriture",1,0
"Les festes du mois d'aoust : St Dominique, La Transfiguration de N. Seigneur, St Laurens, St Barthelemie, L'assomption N. Dame, St Louis, [les vignettes suivantes ont été découpées]",,,,,,,,,,"Image pleine page",français,"Gravure sur cuivre",PAT_17G_193_013_web,,,,,,,,,,,,,,,,,,,,,,,,,,,,,,,,,,,,"Ange,Angelot,Assomption,Auréole,Chien,Christ,Couronne,Couteau,Dominicain,Élie,En vol,Fleur de lys,Gril,Les Apôtres,Les Tables de la Loi,Louis IX (1214-1270, roi de France),Lys,Martyre,Moïse,Palme,Rayons lumineux,Religieux,Roi,Rosaire,Saint,Saint Barthélemy,Saint Dominique de Guzman,Saint Laurent,Sceptre,Tombeau,Torche,Transfiguration,Vierge",https://hieronyma.ict-toulouse.fr/files/original/0edbac70142fa0f4e44070a729244637.jpg,,"Les Fleurs des Vies des saints... [1678]",1,0
"Le veau d'or",,,,,,,,,,"Image mi-page","français ; latin","Gravure sur cuivre",PAT_18G_001_064_web_a,,,,,,,,,,,,,,,,,,,,,,,,,,,,,,,,,,,,"Colère,Destruction,Idole,Les Tables de la Loi,Livre de l'Exode,Moïse,Or,Prière,Veau",https://hieronyma.ict-toulouse.fr/files/original/d717ffa8a6c9c518748673b3322a4a81.JPG,,"L'Ancien et le Nouveau Testament représentés en cinq cens tableaux gravés d'après les desseins de Raphaël & autres grands maîtres et expliqués par les paroles de l'Ecriture",1,0
"La Transfiguration",,,,,,,,,,Planche,,"Gravure sur acier",1133_SAI_2_058_web,,,,,,,,,,,,,,,,,,,,,,,,,,,,,,,,,,,,"Apparition,Christ,Élie,Évangile selon saint Matthieu,Les Tables de la Loi,Moïse,Montagne,Rayons lumineux,Saint Jacques le Majeur,Saint Jean,Saint Pierre,Transfiguration",https://hieronyma.ict-toulouse.fr/files/original/b187749e95cd49d12e5ede8732041f83.JPG,,"La Sainte Bible : traduction nouvelle selon la Vulgate",1,0
"Jesus a l'age de .XII. ans au milieu des docteurs",,,,,,,,,,"Image mi-page","français ; latin","Gravure sur cuivre",PAT_18G_001_175a,,,,,,,,,,,,,,,,,,,,,,,,,,,,,,,,,,,,"Enfance du Christ,Enfant Jésus,Évangile selon saint Luc,Jérusalem,Jésus et les Docteurs,Le Temple,Les Tables de la Loi,Rouleau,Savant",https://hieronyma.ict-toulouse.fr/files/original/ab0917c01de7e0289eff1ab658c198ad.JPG,,"L'Ancien et le Nouveau Testament représentés en cinq cens tableaux gravés d'après les desseins de Raphaël & autres grands maîtres et expliqués par les paroles de l'Ecriture",1,0
"Buisson ardent. Le Veau d'Or",,,,,,,,,,"Pleine page",,"Gravure sur cuivre",PAT_19P_004_003_web,,,,,,,,,,,,,,,,,,,,,,,,,,,,,,,,,,,,"Apparition,Bâton,Briser,Colère,Danse,Dieu le Père,Idole,Josué,Le buisson ardent,Les Tables de la Loi,Moïse,Savignac,Veau",https://hieronyma.ict-toulouse.fr/files/original/87b9b0ad9db9bd50d85c534edf7a34f1.jpg,"Image fixe","Histoire de la Sainte Bible...",1,0
"2e Tables de la Loy",,,,,,,,,,"Image mi-page","français ; latin","Gravure sur cuivre",PAT_18G_001_064_web_b,,,,,,,,,,,,,,,,,,,,,,,,,,,,,,,,,,,,"Les Tables de la Loi,Livre de l'Exode,Moïse,Mont Sinaï,Rayons lumineux",https://hieronyma.ict-toulouse.fr/files/original/78578440bdf4231695e5dec1274d8ee5.JPG,,"L'Ancien et le Nouveau Testament représentés en cinq cens tableaux gravés d'après les desseins de Raphaël & autres grands maîtres et expliqués par les paroles de l'Ecriture",1,0
"[Vignettes illustrant le Livre du Deutéronome]",,,,,,,,,,Vignette,,"Gravure sur cuivre",CAP_17G_046_017_web,,,,,,,,,,,,,,,,,,,,,,,,,,,,,,,,,,,,"Groupe,La Terre promise,Les Tables de la Loi,Livre du Deutéronome,Moïse,Mort",https://hieronyma.ict-toulouse.fr/files/original/e3085a3e463db2309102b3b84dc6e9e6.JPG,"Image fixe","La Sainte Bible",1,0
