﻿"Dublin Core:Title","Dublin Core:Subject","Dublin Core:Description","Dublin Core:Creator","Dublin Core:Source","Dublin Core:Publisher","Dublin Core:Date","Dublin Core:Contributor","Dublin Core:Rights","Dublin Core:Relation","Dublin Core:Format","Dublin Core:Language","Dublin Core:Type","Dublin Core:Identifier","Dublin Core:Coverage","Item Type Metadata:Text","Item Type Metadata:Interviewer","Item Type Metadata:Interviewee","Item Type Metadata:Location","Item Type Metadata:Transcription","Item Type Metadata:Local URL","Item Type Metadata:Original Format","Item Type Metadata:Physical Dimensions","Item Type Metadata:Duration","Item Type Metadata:Compression","Item Type Metadata:Producer","Item Type Metadata:Director","Item Type Metadata:Bit Rate/Frequency","Item Type Metadata:Time Summary","Item Type Metadata:Email Body","Item Type Metadata:Subject Line","Item Type Metadata:From","Item Type Metadata:To","Item Type Metadata:CC","Item Type Metadata:BCC","Item Type Metadata:Number of Attachments","Item Type Metadata:Standards","Item Type Metadata:Objectives","Item Type Metadata:Materials","Item Type Metadata:Lesson Plan Text","Item Type Metadata:URL","Item Type Metadata:Event Type","Item Type Metadata:Participants","Item Type Metadata:Birth Date","Item Type Metadata:Birthplace","Item Type Metadata:Death Date","Item Type Metadata:Occupation","Item Type Metadata:Biographical Text","Item Type Metadata:Bibliography",tags,file,itemType,collection,public,featured
"Zacharie Lapidé Dans le Temple",,,,,,,,,,"Image mi-page","français ; latin","Gravure sur cuivre",PAT_18G_001_134a,,,,,,,,,,,,,,,,,,,,,,,,,,,,,,,,,,,,"Cour,Deuxième Livre des Chroniques,Foule,Lapidation,Mort,Prophète,Temple,Zacharie fils de Joad",https://hieronyma.ict-toulouse.fr/files/original/7b28aec2dae576f55748deebb4036406.JPG,,"L'Ancien et le Nouveau Testament représentés en cinq cens tableaux gravés d'après les desseins de Raphaël & autres grands maîtres et expliqués par les paroles de l'Ecriture",1,0
"Profanateur du Sabat lapidé",,,,,,,,,,"Image mi-page","français ; latin","Gravure sur cuivre",PAT_18G_001_078_web_a,,,,,,,,,,,,,,,,,,,,,,,,,,,,,,,,,,,,"Blasphème,Foule,Lapidation,Livre des Nombres,Pierre,Punition",https://hieronyma.ict-toulouse.fr/files/original/ea3bd22f4e951eed3f3026d5f1e37fb3.JPG,,"L'Ancien et le Nouveau Testament représentés en cinq cens tableaux gravés d'après les desseins de Raphaël & autres grands maîtres et expliqués par les paroles de l'Ecriture",1,0
"Martyre de St Êtienne",,,,,,,,,,"Image mi-page","français ; latin","Gravure sur cuivre",PAT_18G_001_228b,,,,,,,,,,,,,,,,,,,,,,,,,,,,,,,,,,,,"Actes des Apôtres,Lapidation,Manteau,Martyre,Mort,Pierre,Saint Étienne,Saint Paul de Tarse",https://hieronyma.ict-toulouse.fr/files/original/7aae75118b7312f46031a991ebeea5b1.JPG,,"L'Ancien et le Nouveau Testament représentés en cinq cens tableaux gravés d'après les desseins de Raphaël & autres grands maîtres et expliqués par les paroles de l'Ecriture",1,0
"Martyre de saint Étienne.",,,,,,,,,,Planche,,"Gravure sur acier",1133_SAI_2_098_web,,,,,,,,,,,,,,,,,,,,,,,,,,,,,,,,,,,,"Actes des Apôtres,Lapidation,Martyre,Saint Étienne",https://hieronyma.ict-toulouse.fr/files/original/51e1768977af06ea451c69fb3a2ac3f5.JPG,,"La Sainte Bible : traduction nouvelle selon la Vulgate",1,0
"Les Juifs veulent lapider Jesus dans le Temple.",,,,,,,,,,"Image mi-page","français ; latin","Gravure sur cuivre",PAT_18G_001_196b,,,,,,,,,,,,,,,,,,,,,,,,,,,,,,,,,,,,"Cacher,Christ,Évangile selon saint Jean,Foule,Lapidation,Le Temple",https://hieronyma.ict-toulouse.fr/files/original/9c45a39ad55ef0cee21824e2ee9b24f4.JPG,,"L'Ancien et le Nouveau Testament représentés en cinq cens tableaux gravés d'après les desseins de Raphaël & autres grands maîtres et expliqués par les paroles de l'Ecriture",1,0
"Les festes du mois de iuin : St Boniface, St Pierre et St Paul, St Medard, St Claude,  La nativité de St Jean, S. Barnabe, S. Antoine de Pade, S. Gervais et Protais, St Basile",,,,,,,,,,"Image pleine page",français,"Gravure sur cuivre",PAT_17G_193_010_web,,,,,,,,,,,,,,,,,,,,,,,,,,,,,,,,,,,,"Arbre,Chambre,Clé,Crosse,Crucifix,Délivrance,Enfant,Enfant Jésus,Épée,Évêque,Feu,Fleur,Fouet,Lapidation,Mitre,Naissance,Nourrisson,Palme,Pierre,Prisonnier,Saint Antoine de Padoue,Saint Barnabé,Saint Basile de Césarée,Saint Boniface de Mayence,Saint Claude de Besançon,Saint Gervais,Saint Jean Baptiste,Saint Médard,Saint Paul de Tarse,Saint Pierre,Saint Protais,Sainte Elisabeth,Toilette",https://hieronyma.ict-toulouse.fr/files/original/f99d8d909fe53b1480c312414fa0495e.jpg,,"Les Fleurs des Vies des saints... [1678]",1,0
"Les deux Vieillards [accusateurs] de Suzane mis a mort",,,,,,,,,,"Image mi-page","français ; latin","Gravure sur cuivre",PAT_18G_001_151a,,,,,,,,,,,,,,,,,,,,,,,,,,,,,,,,,,,,"Châtiment judiciaire,Lapidation,Livre de Daniel,Vieux",https://hieronyma.ict-toulouse.fr/files/original/113138ca077e98a686c44a50d74d03b6.JPG,,"L'Ancien et le Nouveau Testament représentés en cinq cens tableaux gravés d'après les desseins de Raphaël & autres grands maîtres et expliqués par les paroles de l'Ecriture",1,0
"Justification de Susanne.",,,,,,,,,,Planche,,"Gravure sur acier",1133_SAI_2_015_web,,,,,,,,,,,,,,,,,,,,,,,,,,,,,,,,,,,,"Daniel,Foule,Grand prophète,Jugement,Lapidation,Livre de Daniel,Sentence,Suzanne,Vieux",https://hieronyma.ict-toulouse.fr/files/original/5806dc4f9c5de40e3c60dfb5ab072592.JPG,,"La Sainte Bible : traduction nouvelle selon la Vulgate",1,0
"Jesus déclare aux juifs qu'il est le messie",,,,,,,,,,"Image mi-page","français ; latin","Gravure sur cuivre",PAT_18G_001_197a,,,,,,,,,,,,,,,,,,,,,,,,,,,,,,,,,,,,"Christ,Évangile selon saint Jean,Foule,Lapidation,Le Temple",https://hieronyma.ict-toulouse.fr/files/original/635ddde7691ffc12b70d15576056081e.JPG,,"L'Ancien et le Nouveau Testament représentés en cinq cens tableaux gravés d'après les desseins de Raphaël & autres grands maîtres et expliqués par les paroles de l'Ecriture",1,0
"Effigies Ieremiae Prophetae",,,,,,,,,,"Image pleine page",,"Gravure sur cuivre",CAP_17G_046_045_web,,,,,,,,,,,,,,,,,,,,,,,,,,,,,,,,,,,,"Dieu le Père,Jérémie,Lapidation,Livre de Jérémie,Main,Supplice",https://hieronyma.ict-toulouse.fr/files/original/506443bd0d743ae976eba892f4b2c33f.JPG,"Image fixe","La Sainte Bible",1,0
