﻿"Dublin Core:Title","Dublin Core:Subject","Dublin Core:Description","Dublin Core:Creator","Dublin Core:Source","Dublin Core:Publisher","Dublin Core:Date","Dublin Core:Contributor","Dublin Core:Rights","Dublin Core:Relation","Dublin Core:Format","Dublin Core:Language","Dublin Core:Type","Dublin Core:Identifier","Dublin Core:Coverage","Item Type Metadata:Text","Item Type Metadata:Interviewer","Item Type Metadata:Interviewee","Item Type Metadata:Location","Item Type Metadata:Transcription","Item Type Metadata:Local URL","Item Type Metadata:Original Format","Item Type Metadata:Physical Dimensions","Item Type Metadata:Duration","Item Type Metadata:Compression","Item Type Metadata:Producer","Item Type Metadata:Director","Item Type Metadata:Bit Rate/Frequency","Item Type Metadata:Time Summary","Item Type Metadata:Email Body","Item Type Metadata:Subject Line","Item Type Metadata:From","Item Type Metadata:To","Item Type Metadata:CC","Item Type Metadata:BCC","Item Type Metadata:Number of Attachments","Item Type Metadata:Standards","Item Type Metadata:Objectives","Item Type Metadata:Materials","Item Type Metadata:Lesson Plan Text","Item Type Metadata:URL","Item Type Metadata:Event Type","Item Type Metadata:Participants","Item Type Metadata:Birth Date","Item Type Metadata:Birthplace","Item Type Metadata:Death Date","Item Type Metadata:Occupation","Item Type Metadata:Biographical Text","Item Type Metadata:Bibliography",tags,file,itemType,collection,public,featured
"[Lapidation d'un blasphémateur]",,,,,,,,,,"Pleine page",,"Gravure sur bois",PAT_16M_022_113_web,,,,,,,,,,,,,,,,,,,,,,,,,,,,,,,,,,,,"Blasphème,Foule,Lapidation,Livre du Lévitique,Pierre,Punition",https://hieronyma.ict-toulouse.fr/files/original/e0b150a5b2a1666cb003475aae759c69.jpg,"Image fixe","[Bible, latin, 1574]",1,0
"[Lapidation des deux vieillards]",,,,,,,,,,Vignette,,"Gravure sur bois",PAT_16M_022_270_web,,,,,,,,,,,,,,,,,,,,,,,,,,,,,,,,,,,,"Diable,Hybride,Jugement,Lapidation,Livre de Daniel,Sentence,Vieux,Zoomorphe",https://hieronyma.ict-toulouse.fr/files/original/e9649387e1a0b3622d6ad57fb7c87733.jpg,"Image fixe","[Bible, latin, 1574]",1,0
"[Lapidation du prêtre Zacharie]",,,,,,,,,,Vignette,,"Gravure sur bois",PAT_16M_022_233_web,,,,,,,,,,,,,,,,,,,,,,,,,,,,,,,,,,,,"Deuxième Livre des Chroniques,Extérieur,Joas de Juda,Lapidation,Le Temple,Ordre,Prêtre,Roi,Zacharie fils de Joad",https://hieronyma.ict-toulouse.fr/files/original/8d70d15a0e5c708d255f6371511c929f.jpg,"Image fixe","[Bible, latin, 1574]",1,0
"[Le Bon Pasteur. Les Pharisiens tentent de lapider Jésus dans le Temple] ",,,,,,,,,,Vignettes,latin,"Gravure sur bois",PAT_16M_022_398_web,,,,,,,,,,,,,,,,,,,,,,,,,,,,,,,,,,,,"Berger,Brebis,Christ,Christ enseignant,Évangile selon saint Jean,Ferme,Jérusalem,Lance,Lapidation,Le Temple,Loup,Pierre",https://hieronyma.ict-toulouse.fr/files/original/db3484d42e43f5a31e4e75cb2625f92c.jpg,,"[Bible, latin, 1574]",1,0
"[Le Martyre de Saint Étienne. Saint Philippe et l'eunuque éthiopien]",,,,,,,,,,Vignettes,latin,"Gravure sur bois",PAT_16M_022_410_web,,,,,,,,,,,,,,,,,,,,,,,,,,,,,,,,,,,,"Actes des Apôtres,Char,Conversion,Lapidation,Lecture,Martyre,Pierre,Prière,Rayons lumineux,Saint Étienne,Saint Philippe,Soldat",https://hieronyma.ict-toulouse.fr/files/original/bad31b621a4121ccc6f45c6bccf9d0ec.jpg,,"[Bible, latin, 1574]",1,0
"[Les Pharisiens tentent de lapider Jésus dans le Temple]",,,,,,,,,,Vignette,latin,"Gravure sur bois",PAT_16M_022_396_web,,,,,,,,,,,,,,,,,,,,,,,,,,,,,,,,,,,,"Christ,Évangile selon saint Jean,Jérusalem,Lapidation,Le Temple,Pierre",https://hieronyma.ict-toulouse.fr/files/original/d1081cec086a0c002a07bf3a282115b6.jpg,,"[Bible, latin, 1574]",1,0
"[Naboth est lapidé sur l'ordre de Jézabel]",,,,,,,,,,Vignette,,"Gravure sur bois",PAT_16M_022_205_web,,,,,,,,,,,,,,,,,,,,,,,,,,,,,,,,,,,,"Extérieur,Lapidation,Naboth,Premier Livre des Rois,Ville",https://hieronyma.ict-toulouse.fr/files/original/e6c5c8334d958954c9b945d43a7f31db.jpg,"Image fixe","[Bible, latin, 1574]",1,0
"[Vignettes illustrant le Livre de Josué]",,,,,,,,,,Vignette,,"Gravure sur cuivre",CAP_17G_046_020_web,,,,,,,,,,,,,,,,,,,,,,,,,,,,,,,,,,,,"Acan,Armée,Bataille,Destruction,Espionnage,Fuite,Gué,Jéricho,Josué,Jourdain,L'arche d'alliance,Lapidation,Livre de Josué,Lune,Miracle,Pierre,Prêtre,Procession,Rahab,Rempart,Soleil,Trompe,Ville",https://hieronyma.ict-toulouse.fr/files/original/8ce265b5f1bff25e64efba19f89e0bc3.JPG,"Image fixe","La Sainte Bible",1,0
"[Vignettes illustrant les Actes des Apôtres]",,,,,,,,,,Vignette,,"Gravure sur cuivre",CAP_17G_046_062_web,,,,,,,,,,,,,,,,,,,,,,,,,,,,,,,,,,,,"Ange,Ascension,Char,Christ,Chute,Enfant,Lapidation,Les Apôtres,Livre des Actes des Apôtres,Martyre,Nouveau Testament,Pied,Prison,Rayons lumineux,Rocher,Saint Étienne,Saint Pierre,Soldat,Supplice",https://hieronyma.ict-toulouse.fr/files/original/57178324648362fc9b39ac9107c06053.JPG,"Image fixe","La Sainte Bible",1,0
"Achan lapidé.",,,,,,,,,,Planche,,"Gravure sur acier",1133_SAI_1_047_web,,,,,,,,,,,,,,,,,,,,,,,,,,,,,,,,,,,,"Acan,Cadavre,Lapidation,Livre de Josué,Vautour",https://hieronyma.ict-toulouse.fr/files/original/fae92bb521cfc58780d0901e04c95c45.JPG,"Image fixe","La Sainte Bible : traduction nouvelle selon la Vulgate",1,0
