﻿"Dublin Core:Title","Dublin Core:Subject","Dublin Core:Description","Dublin Core:Creator","Dublin Core:Source","Dublin Core:Publisher","Dublin Core:Date","Dublin Core:Contributor","Dublin Core:Rights","Dublin Core:Relation","Dublin Core:Format","Dublin Core:Language","Dublin Core:Type","Dublin Core:Identifier","Dublin Core:Coverage","Item Type Metadata:Text","Item Type Metadata:Interviewer","Item Type Metadata:Interviewee","Item Type Metadata:Location","Item Type Metadata:Transcription","Item Type Metadata:Local URL","Item Type Metadata:Original Format","Item Type Metadata:Physical Dimensions","Item Type Metadata:Duration","Item Type Metadata:Compression","Item Type Metadata:Producer","Item Type Metadata:Director","Item Type Metadata:Bit Rate/Frequency","Item Type Metadata:Time Summary","Item Type Metadata:Email Body","Item Type Metadata:Subject Line","Item Type Metadata:From","Item Type Metadata:To","Item Type Metadata:CC","Item Type Metadata:BCC","Item Type Metadata:Number of Attachments","Item Type Metadata:Standards","Item Type Metadata:Objectives","Item Type Metadata:Materials","Item Type Metadata:Lesson Plan Text","Item Type Metadata:URL","Item Type Metadata:Event Type","Item Type Metadata:Participants","Item Type Metadata:Birth Date","Item Type Metadata:Birthplace","Item Type Metadata:Death Date","Item Type Metadata:Occupation","Item Type Metadata:Biographical Text","Item Type Metadata:Bibliography",tags,file,itemType,collection,public,featured
"[Abner tue Asahel]",,,,,,,,,,"Pleine page",,"Gravure sur bois",PAT_16M_022_171_web,,,,,,,,,,,,,,,,,,,,,,,,,,,,,,,,,,,,"Abner,Asahel,Cavalier,Cheval,Deuxième livre de Samuel,Fuite,Lance,Mort par coup,Poursuite militaire",https://hieronyma.ict-toulouse.fr/files/original/9d2ef4b36d41e25be28d8238bac47732.jpg,"Image fixe","[Bible, latin, 1574]",1,0
[Bandeau],,,,,,,,,,"Ornement typographique",français,"Gravure sur bois",FD_487-1_006_web,,,,,,,,,,,,,,,,,,,,,,,,,,,,,,,,,,,,"Étendard,Lance,Trompette",https://hieronyma.ict-toulouse.fr/files/original/8da79f8d1748e61e849a81d5912ca796.jpg,,"Les aventures de Télémaque, fils d'Ulysse",1,0
[Cavalier],,,,,,,,,,Planche,français,"Gravure sur cuivre",PAT_18P_280-3_005_web,,,,,,,,,,,,,,,,,,,,,,,,,,,,,,,,,,,,"Arc,Bouclier,Cavalier,Cheval,Flèche,Iran,Lance,Sabre,Soldat",https://hieronyma.ict-toulouse.fr/files/original/555f858f2f80b5b2fa70c926b12bb7b3.jpg,,"Voyages de Mr. Le Chevalier Chardin, en Perse, et autres lieux de l'Orient. Tome Troisième",1,0
"[De l’arrivée de Clavilègne, avec la fin de cette longue aventure.]",,,,,,,,,,Vignette,,"Gravure sur bois",S_1826_032_web,,,,,,,,,,,,,,,,,,,,,,,,,,,,,,,,,,,,"Cheval,Don Quichotte,Lance,Soldat",https://hieronyma.ict-toulouse.fr/files/original/eef0ef5d843e5f9d54c77a13950b6594.jpg,"Image fixe","Don Quichotte",1,0
"[De la terrible et fatigante conclusion qu’eut le gouvernement de Sancho Panza]",,,,,,,,,,Vignette,,"Gravure sur bois",S_1826_031_web,,,,,,,,,,,,,,,,,,,,,,,,,,,,,,,,,,,,"Don Quichotte,Épée,Lance,Noblesse",https://hieronyma.ict-toulouse.fr/files/original/9bfc7fbe835911b0a68f6de8bfcccafe.jpg,"Image fixe","Don Quichotte",1,0
"[Débora et Baraq]",,,,,,,,,,"Pleine page",,"Gravure sur bois",PAT_16M_022_134_web,,,,,,,,,,,,,,,,,,,,,,,,,,,,,,,,,,,,"Armée,Assis,Baraq,Débora,Fuite,Lance,Livre des Juges,Tente,Victoire",https://hieronyma.ict-toulouse.fr/files/original/e9f3b88cc6a0c0afc70e1d1a3542db98.jpg,"Image fixe","[Bible, latin, 1574]",1,0
"[Frontispice : La Pucelle ou la France délivrée.]",,,,,,,,,,"Image pleine page",français,"Gravure sur cuivre",PAT_17P_688_001_web,,,,,,,,,,,,,,,,,,,,,,,,,,,,,,,,,,,,"Allégorie,Ange,Armoiries,Bord de mer,Chaîne,Couronne,Délivrance,Épée,Fleur de lys,France,Jeanne d'Arc (1412-1431, sainte),Lance,Putti,Rayons lumineux,Sceptre,Ville",https://hieronyma.ict-toulouse.fr/files/original/248f3a7eb5b659bc1c460f33993f07c4.jpg,,"La pucelle, : ou la France délivrée : poëme héroïque / par M. Chapelain",1,0
"[L'ouverture des sept sceaux. Les quatre cavaliers de l'Apocalypse]",,,,,,,,,,Vignettes,latin,"Gravure sur bois",PAT_16M_022_433_web,,,,,,,,,,,,,,,,,,,,,,,,,,,,,,,,,,,,"Allégorie,Ange,Arc,Balance,Cadavre,Cavalier,Damné,Dieu le Père,Épée,Famine,Flamme,Guerre de siège,La guerre,Lance,Lecture,Livre,Livre de l'Apocalypse,Mort,Soldat,Squelette,Vision",https://hieronyma.ict-toulouse.fr/files/original/b0a1d05b6b9a0c5827a6d76da1667515.jpg,,"[Bible, latin, 1574]",1,0
"[Le Bon Pasteur. Les Pharisiens tentent de lapider Jésus dans le Temple] ",,,,,,,,,,Vignettes,latin,"Gravure sur bois",PAT_16M_022_398_web,,,,,,,,,,,,,,,,,,,,,,,,,,,,,,,,,,,,"Berger,Brebis,Christ,Christ enseignant,Évangile selon saint Jean,Ferme,Jérusalem,Lance,Lapidation,Le Temple,Loup,Pierre",https://hieronyma.ict-toulouse.fr/files/original/db3484d42e43f5a31e4e75cb2625f92c.jpg,,"[Bible, latin, 1574]",1,0
"[p. 17 : Ramon, XIVe comte de Toulouse, et Ramon, XVe comte de Toulouse]",,,,,,,,,,"Image mi-page",,"Gravure sur cuivre",RF_58_012_web,,,,,,,,,,,,,,,,,,,,,,,,,,,,,,,,,,,,"Armure,Croix,Épée,Lance,Raimond,Toulouse",https://hieronyma.ict-toulouse.fr/files/original/532fd06bea4679e60581a0039d8ce38d.jpg,"Image fixe","Histoire des comtes de Tolose",1,0
