﻿"Dublin Core:Title","Dublin Core:Subject","Dublin Core:Description","Dublin Core:Creator","Dublin Core:Source","Dublin Core:Publisher","Dublin Core:Date","Dublin Core:Contributor","Dublin Core:Rights","Dublin Core:Relation","Dublin Core:Format","Dublin Core:Language","Dublin Core:Type","Dublin Core:Identifier","Dublin Core:Coverage","Item Type Metadata:Text","Item Type Metadata:Interviewer","Item Type Metadata:Interviewee","Item Type Metadata:Location","Item Type Metadata:Transcription","Item Type Metadata:Local URL","Item Type Metadata:Original Format","Item Type Metadata:Physical Dimensions","Item Type Metadata:Duration","Item Type Metadata:Compression","Item Type Metadata:Producer","Item Type Metadata:Director","Item Type Metadata:Bit Rate/Frequency","Item Type Metadata:Time Summary","Item Type Metadata:Email Body","Item Type Metadata:Subject Line","Item Type Metadata:From","Item Type Metadata:To","Item Type Metadata:CC","Item Type Metadata:BCC","Item Type Metadata:Number of Attachments","Item Type Metadata:Standards","Item Type Metadata:Objectives","Item Type Metadata:Materials","Item Type Metadata:Lesson Plan Text","Item Type Metadata:URL","Item Type Metadata:Event Type","Item Type Metadata:Participants","Item Type Metadata:Birth Date","Item Type Metadata:Birthplace","Item Type Metadata:Death Date","Item Type Metadata:Occupation","Item Type Metadata:Biographical Text","Item Type Metadata:Bibliography",tags,file,itemType,collection,public,featured
"Henriade, Chant IX",,,,,,,,,,Planche,,"Gravure sur cuivre",PAT_18P_179_017_web,,,,,,,,,,,,,,,,,,,,,,,,,,,,,,,,,,,,"Amour,Épée,Étreinte,Gabrielle d'Estrées,Henri IV (1553-1610, roi de France),Jardin,JEP2019,Putti",https://hieronyma.ict-toulouse.fr/files/original/3a979bef18b2a20d98bd4629c31fc70b.jpg,"Image fixe","La Henriade. 1787",1,0
Irivan,,,,,,,,,,Planche,,"Gravure sur cuivre",PAT_18P_280-2_003_web,,,,,,,,,,,,,,,,,,,,,,,,,,,,,,,,,,,,"Arménie,Erevan,Jardin,Ville",https://hieronyma.ict-toulouse.fr/files/original/acd85739e754b2f68e5a0ab94dcb58b7.JPG,"Image fixe","Voyages de Mr. Le Chevalier Chardin, en Perse, et autres lieux de l'Orient. Tome Second",1,1
"Jesus apparoit a Marie Madeleine qui le prend pour le jardinier.",,,,,,,,,,"Image mi-page","français ; latin","Gravure sur cuivre",PAT_18G_001_223b,,,,,,,,,,,,,,,,,,,,,,,,,,,,,,,,,,,,"Apparition à Madeleine,Apparition du Christ,Christ,Évangile selon saint Jean,Jardin,Jardinier,La Résurrection,Outil,Sainte Madeleine",https://hieronyma.ict-toulouse.fr/files/original/ddf3c87f6fd98fbcb1223377e69295c9.JPG,,"L'Ancien et le Nouveau Testament représentés en cinq cens tableaux gravés d'après les desseins de Raphaël & autres grands maîtres et expliqués par les paroles de l'Ecriture",1,0
"Jésus au jardin des Oliviers",,,,,,,,,,Planche,,"Gravure sur acier",1133_SAI_2_076_web,,,,,,,,,,,,,,,,,,,,,,,,,,,,,,,,,,,,"Agonie du Christ,Ange,Apparition,Christ,Évangile selon saint Luc,Jardin,Jardin des oliviers",https://hieronyma.ict-toulouse.fr/files/original/d25fd549547fcc5c82cf1fbcceffe694.JPG,,"La Sainte Bible : traduction nouvelle selon la Vulgate",1,0
"Jésus dans le jardin des olives.",,,,,,,,,,"Image mi-page","français ; latin","Gravure sur cuivre",PAT_18G_001_212a,,,,,,,,,,,,,,,,,,,,,,,,,,,,,,,,,,,,"Agonie du Christ,Ange,Apparition,Christ,Coupe (récipient),Évangile selon saint Luc,Jardin,Jardin des oliviers,Les Apôtres,Nuit,Passion,Sommeil",https://hieronyma.ict-toulouse.fr/files/original/9ebd7e9dee3bad2c22b647a85fdbba1d.JPG,,"L'Ancien et le Nouveau Testament représentés en cinq cens tableaux gravés d'après les desseins de Raphaël & autres grands maîtres et expliqués par les paroles de l'Ecriture",1,0
Kom,,,,,,,,,,Planche,français,"Gravure sur cuivre",PAT_18P_280-3_002_web,,,,,,,,,,,,,,,,,,,,,,,,,,,,,,,,,,,,"Iran,Jardin,Montagne,Qom (Iran),Rivière,Ville",https://hieronyma.ict-toulouse.fr/files/original/1c33bfd27f14b8dd793205931fb29caf.jpg,,"Voyages de Mr. Le Chevalier Chardin, en Perse, et autres lieux de l'Orient. Tome Troisième",1,0
"Le baiser de Judas.",,,,,,,,,,Planche,,"Gravure sur acier",1133_SAI_2_077_web,,,,,,,,,,,,,,,,,,,,,,,,,,,,,,,,,,,,"Arrestation du Christ,Baiser de Judas,Christ,Évangile selon saint Matthieu,Foule,Jardin,Jardin des oliviers,Judas,Nuit",https://hieronyma.ict-toulouse.fr/files/original/3152123cde785f87ada3a2cf0f4f6707.JPG,,"La Sainte Bible : traduction nouvelle selon la Vulgate",1,0
"Liv. 19 : Telemaque entre dans les Champs Elisées, où il est reconnu par Acrise son Grand-Pere.",,,,,,,,,,Planche,français,"Gravure sur cuivre",FD_487-2_007_web,,,,,,,,,,,,,,,,,,,,,,,,,,,,,,,,,,,,"Encensoir,Famille,Fontaine,Jardin,Les champs Elysées,Roi,Télémaque",https://hieronyma.ict-toulouse.fr/files/original/024277d00403e3c907f86f2febf689ee.jpg,,"Les aventures de Télémaque, fils d'Ulysse",1,0
"Livre V. Planche IX : [Réalisation d'un plan]",,,,,,,,,,Planche,,"Gravure sur cuivre",PAT_18M_049_031_web,,,,,,,,,,,,,,,,,,,,,,,,,,,,,,,,,,,,"Géométrie,Jardin,Maison,Plan",https://hieronyma.ict-toulouse.fr/files/original/85524c670b51a79b18f5c7deef9f4ce3.JPG,"Image fixe","Geometrie élémentaire et pratique",1,0
"Parterre à l'anglaise et parterre mélangé",,,,,,,,,,Planche,,"Gravure sur cuivre",X_448_2_007_web,,,,,,,,,,,,,,,,,,,,,,,,,,,,,,,,,,,,"Jardin,Représentation scientifique",https://hieronyma.ict-toulouse.fr/files/original/65a19134825d22ecd9418c2223a62b49.jpg,"Image fixe","Spectacle de la nature 2.",1,0
