﻿"Dublin Core:Title","Dublin Core:Subject","Dublin Core:Description","Dublin Core:Creator","Dublin Core:Source","Dublin Core:Publisher","Dublin Core:Date","Dublin Core:Contributor","Dublin Core:Rights","Dublin Core:Relation","Dublin Core:Format","Dublin Core:Language","Dublin Core:Type","Dublin Core:Identifier","Dublin Core:Coverage","Item Type Metadata:Text","Item Type Metadata:Interviewer","Item Type Metadata:Interviewee","Item Type Metadata:Location","Item Type Metadata:Transcription","Item Type Metadata:Local URL","Item Type Metadata:Original Format","Item Type Metadata:Physical Dimensions","Item Type Metadata:Duration","Item Type Metadata:Compression","Item Type Metadata:Producer","Item Type Metadata:Director","Item Type Metadata:Bit Rate/Frequency","Item Type Metadata:Time Summary","Item Type Metadata:Email Body","Item Type Metadata:Subject Line","Item Type Metadata:From","Item Type Metadata:To","Item Type Metadata:CC","Item Type Metadata:BCC","Item Type Metadata:Number of Attachments","Item Type Metadata:Standards","Item Type Metadata:Objectives","Item Type Metadata:Materials","Item Type Metadata:Lesson Plan Text","Item Type Metadata:URL","Item Type Metadata:Event Type","Item Type Metadata:Participants","Item Type Metadata:Birth Date","Item Type Metadata:Birthplace","Item Type Metadata:Death Date","Item Type Metadata:Occupation","Item Type Metadata:Biographical Text","Item Type Metadata:Bibliography",tags,file,itemType,collection,public,featured
"[Bandeau et fleuron]",,,,,,,,,,"Ornement typographique",latin,"Gravure sur bois",RES_16M_502_017_web,,,,,,,,,,,,,,,,,,,,,,,,,,,,,,,,,,,,"Décor d'architecture,Femme,Hybride,Ornement à forme végétale,Sphinx,Tête",https://hieronyma.ict-toulouse.fr/files/original/04d753df3e4678159446bacb01a4d096.jpg,,"Rosario della sacratiss. Virgine Maria",1,0
[Bandeau],,,,,,,,,,"Ornement typographique",,"Gravure sur bois",CAP_17G_120_006_web,,,,,,,,,,,,,,,,,,,,,,,,,,,,,,,,,,,,"Anthropomorphe,Chasse à courre,Chien,Élément végétal,Homme,Hybride",https://hieronyma.ict-toulouse.fr/files/original/e8a5798df2a06eae2066596731608186.jpg,"Image fixe","La triple couronne de la bien-heureuse Vierge",1,0
[Bandeau],,,"Picart, Bernard, 1673-1733, Illustrateur",,,,,,,"Ornement typographique",français,"Gravure sur cuivre",PAT_18G_002_001_web,,,,,,,,,,,,,,,,,,,,,,,,,,,,,,,,,,,,"Hybride,I.H.S.,Ornement à forme végétale,Ostensoir,Rayons lumineux,Tête",https://hieronyma.ict-toulouse.fr/files/original/ab489f76bc6dedf9afe421d4b775c153.jpg,,"Ceremonies et coutumes religieuses de tous les peuples du monde..., 2",1,0
[Bandeau],,,,,,,,,,"Ornement typographique",latin,"Gravure sur bois",CAP_17M_078_020_web,,,,,,,,,,,,,,,,,,,,,,,,,,,,,,,,,,,,"Chien,Hybride,Ornement à forme végétale,Serpent,Tête",https://hieronyma.ict-toulouse.fr/files/original/e6bf2fa687c22feb7153371bf2609d7a.jpg,,"Chronicon SS. Deiparae Virginis Mariae [...]",1,0
[Bandeau],,,,,,,,,,"Ornement typographique",italien,"Gravure sur bois",RES_16M_502_009_web,,,,,,,,,,,,,,,,,,,,,,,,,,,,,,,,,,,,"Décor d'architecture,Hybride,Tête",https://hieronyma.ict-toulouse.fr/files/original/79eafd2f00b5730064a67218de5b0e64.jpg,,"Rosario della sacratiss. Virgine Maria",1,0
[Bandeau],,,,,,,,,,"Ornement typographique",italien,"Gravure sur bois",RES_16M_502_011_web,,,,,,,,,,,,,,,,,,,,,,,,,,,,,,,,,,,,"Décor d'architecture,Hybride,Ornement à forme végétale,Tête",https://hieronyma.ict-toulouse.fr/files/original/2450c4ef0fe6c7d77301a285b9230c64.jpg,,"Rosario della sacratiss. Virgine Maria",1,0
"[Fleuron et lettre I]",,,,,,,,,,"Ornement typographique ; Initiale ornée",latin,"Gravure sur bois",RES_16M_502_019_web,,,,,,,,,,,,,,,,,,,,,,,,,,,,,,,,,,,,"Branche,Hybride,Lampe à huile,Lettre I,Ornement à forme végétale,Tête",https://hieronyma.ict-toulouse.fr/files/original/67e1914ed54aa0ccfe13f12588abf525.jpg,,"Rosario della sacratiss. Virgine Maria",1,0
"[Fleuron, lettre A]",,,,,,,,,,"Ornement typographique ; Initiale ornée",latin,"Gravure sur bois",RES_16M_502_029_web,,,,,,,,,,,,,,,,,,,,,,,,,,,,,,,,,,,,"Branche,Faune,Hybride,Lettre A",https://hieronyma.ict-toulouse.fr/files/original/bcb2181e05c5ed63c74f285549c29f8b.jpg,,"Rosario della sacratiss. Virgine Maria",1,0
[Fleuron],,,,,,,,,,"Ornement typographique",italien,"Gravure sur bois",RES_16M_502_027_web,,,,,,,,,,,,,,,,,,,,,,,,,,,,,,,,,,,,"Hybride,Tête,Vase",https://hieronyma.ict-toulouse.fr/files/original/022986fef1b6bf92877c4333b8d9dffe.jpg,,"Rosario della sacratiss. Virgine Maria",1,0
"[La Femme vêtue de soleil. Les deux Bêtes de la terre et de la mer]",,,,,,,,,,Vignettes,latin,"Gravure sur bois",PAT_16M_022_438_web,,,,,,,,,,,,,,,,,,,,,,,,,,,,,,,,,,,,"Aigle,Aile,Archange,Combat,Dieu le Père,Dragon,Enfant,Étoile,Femme,Foule,Hybride,Livre de l'Apocalypse,Lune,Saint Michel,Satan,Soleil,Vision,Zoomorphe",https://hieronyma.ict-toulouse.fr/files/original/d52403bbb7a7cc631bcde6ce21fbbc8e.jpg,,"[Bible, latin, 1574]",1,0
