﻿"Dublin Core:Title","Dublin Core:Subject","Dublin Core:Description","Dublin Core:Creator","Dublin Core:Source","Dublin Core:Publisher","Dublin Core:Date","Dublin Core:Contributor","Dublin Core:Rights","Dublin Core:Relation","Dublin Core:Format","Dublin Core:Language","Dublin Core:Type","Dublin Core:Identifier","Dublin Core:Coverage","Item Type Metadata:Text","Item Type Metadata:Interviewer","Item Type Metadata:Interviewee","Item Type Metadata:Location","Item Type Metadata:Transcription","Item Type Metadata:Local URL","Item Type Metadata:Original Format","Item Type Metadata:Physical Dimensions","Item Type Metadata:Duration","Item Type Metadata:Compression","Item Type Metadata:Producer","Item Type Metadata:Director","Item Type Metadata:Bit Rate/Frequency","Item Type Metadata:Time Summary","Item Type Metadata:Email Body","Item Type Metadata:Subject Line","Item Type Metadata:From","Item Type Metadata:To","Item Type Metadata:CC","Item Type Metadata:BCC","Item Type Metadata:Number of Attachments","Item Type Metadata:Standards","Item Type Metadata:Objectives","Item Type Metadata:Materials","Item Type Metadata:Lesson Plan Text","Item Type Metadata:URL","Item Type Metadata:Event Type","Item Type Metadata:Participants","Item Type Metadata:Birth Date","Item Type Metadata:Birthplace","Item Type Metadata:Death Date","Item Type Metadata:Occupation","Item Type Metadata:Biographical Text","Item Type Metadata:Bibliography",tags,file,itemType,collection,public,featured
"Famine de Samarie.",,,,,,,,,,Planche,,"Gravure sur acier",1133_SAI_1_097_web,,,,,,,,,,,,,,,,,,,,,,,,,,,,,,,,,,,,"Demande,Deuxième Livre des Rois,Famine,Femme,Guerre de siège,Rempart,Roi",https://hieronyma.ict-toulouse.fr/files/original/7706cabcb4607743cf09c78927a4f297.JPG,"Image fixe","La Sainte Bible : traduction nouvelle selon la Vulgate",1,0
"[Page de texte : Début du livre second]",,,,,,,,,,"Pleine page",,,PAT_17M_185_008_web,,,,,,,,,,,,,,,,,,,,,,,,,,,,,,,,,,,,"Guerre de siège,Lettre Q",https://hieronyma.ict-toulouse.fr/files/original/98052c3c348e3b0f546395f3470a4979.jpg,"Image fixe","Histoire du lutheranisme",1,0
"[Bandeau : Assaut contre une ville]",,,,,,,,,,Vignette,,"Gravure sur cuivre",PAT_17M_185_009_web,,,,,,,,,,,,,,,,,,,,,,,,,,,,,,,,,,,,"Armée,Assaut,Cavalier,Échelle,Guerre de siège,Opération militaire,Rempart,Ville",https://hieronyma.ict-toulouse.fr/files/original/457cc418a502bed53719b26eb8a1c21b.jpg,"Image fixe","Histoire du lutheranisme",1,0
"[Mort d'Abimélek]",,,,,,,,,,"Pleine page",,"Gravure sur bois",PAT_16M_022_137_web,,,,,,,,,,,,,,,,,,,,,,,,,,,,,,,,,,,,"Abimélek (Juge d'Israël),Arbalète,Femme,Guerre de siège,Livre des Juges,Meule,Mort par coup,Rempart",https://hieronyma.ict-toulouse.fr/files/original/7527d97e7b6fa4f9e0ce4fff11e39db4.jpg,"Image fixe","[Bible, latin, 1574]",1,0
"[Joab parlemente avec une femme de la ville d'Abel-Beth-Maaka]",,,,,,,,,,"Pleine page",,"Gravure sur bois",PAT_16M_022_182_web,,,,,,,,,,,,,,,,,,,,,,,,,,,,,,,,,,,,"Deuxième livre de Samuel,Guerre de siège,Joab,Rempart,Trêve,Ville",https://hieronyma.ict-toulouse.fr/files/original/24013fe33c00f224b6989625e70ba724.jpg,"Image fixe","[Bible, latin, 1574]",1,0
"[Zimri assassine le roi Ela]",,,,,,,,,,Vignette,,"Gravure sur bois",PAT_16M_022_201_web,,,,,,,,,,,,,,,,,,,,,,,,,,,,,,,,,,,,"Banquet,Ela,Guerre de siège,Incendie,Ivresse,Meurtre,Mort par le fer,Premier Livre des Rois,Roi,Zimri",https://hieronyma.ict-toulouse.fr/files/original/d1038a8899f86fab89fb51a5762dfb5a.jpg,"Image fixe","[Bible, latin, 1574]",1,0
"[L'ouverture des sept sceaux. Les quatre cavaliers de l'Apocalypse]",,,,,,,,,,Vignettes,latin,"Gravure sur bois",PAT_16M_022_433_web,,,,,,,,,,,,,,,,,,,,,,,,,,,,,,,,,,,,"Allégorie,Ange,Arc,Balance,Cadavre,Cavalier,Damné,Dieu le Père,Épée,Famine,Flamme,Guerre de siège,La guerre,Lance,Lecture,Livre,Livre de l'Apocalypse,Mort,Soldat,Squelette,Vision",https://hieronyma.ict-toulouse.fr/files/original/b0a1d05b6b9a0c5827a6d76da1667515.jpg,,"[Bible, latin, 1574]",1,0
"Abimelech tué par une femme au siège de Thebés.",,,,,,,,,,"Image mi-page","français ; latin","Gravure sur cuivre",PAT_18G_001_090_web_b,,,,,,,,,,,,,,,,,,,,,,,,,,,,,,,,,,,,"Abimélek (Juge d'Israël),Femme,Guerre de siège,Livre des Juges,Meule,Mort,Soldat,Tour",https://hieronyma.ict-toulouse.fr/files/original/03959e229c43b2896a454b5aec684fd0.JPG,,"L'Ancien et le Nouveau Testament représentés en cinq cens tableaux gravés d'après les desseins de Raphaël & autres grands maîtres et expliqués par les paroles de l'Ecriture",1,0
"Tête de Seba jettée a Joab qui leve le siége d'Abela.",,,,,,,,,,"Image mi-page","français ; latin","Gravure sur cuivre",PAT_18G_001_117a,,,,,,,,,,,,,,,,,,,,,,,,,,,,,,,,,,,,"Armée,Cadavre,Deuxième livre de Samuel,Guerre de siège,Joab,Rempart,Tête",https://hieronyma.ict-toulouse.fr/files/original/1139298dac8653a8d0d55616e360cf16.JPG,,"L'Ancien et le Nouveau Testament représentés en cinq cens tableaux gravés d'après les desseins de Raphaël & autres grands maîtres et expliqués par les paroles de l'Ecriture",1,0
"Zambri se brûle dans son palais.",,,,,,,,,,"Image mi-page","français ; latin","Gravure sur cuivre",PAT_18G_001_125a,,,,,,,,,,,,,,,,,,,,,,,,,,,,,,,,,,,,"Armée,Guerre de siège,Incendie,Palais,Premier Livre des Rois,Suicide,Zimri",https://hieronyma.ict-toulouse.fr/files/original/8ff0a4da95eb95eafedc377d65a6ca13.JPG,,"L'Ancien et le Nouveau Testament représentés en cinq cens tableaux gravés d'après les desseins de Raphaël & autres grands maîtres et expliqués par les paroles de l'Ecriture",1,0
