﻿"Dublin Core:Title","Dublin Core:Subject","Dublin Core:Description","Dublin Core:Creator","Dublin Core:Source","Dublin Core:Publisher","Dublin Core:Date","Dublin Core:Contributor","Dublin Core:Rights","Dublin Core:Relation","Dublin Core:Format","Dublin Core:Language","Dublin Core:Type","Dublin Core:Identifier","Dublin Core:Coverage","Item Type Metadata:Text","Item Type Metadata:Interviewer","Item Type Metadata:Interviewee","Item Type Metadata:Location","Item Type Metadata:Transcription","Item Type Metadata:Local URL","Item Type Metadata:Original Format","Item Type Metadata:Physical Dimensions","Item Type Metadata:Duration","Item Type Metadata:Compression","Item Type Metadata:Producer","Item Type Metadata:Director","Item Type Metadata:Bit Rate/Frequency","Item Type Metadata:Time Summary","Item Type Metadata:Email Body","Item Type Metadata:Subject Line","Item Type Metadata:From","Item Type Metadata:To","Item Type Metadata:CC","Item Type Metadata:BCC","Item Type Metadata:Number of Attachments","Item Type Metadata:Standards","Item Type Metadata:Objectives","Item Type Metadata:Materials","Item Type Metadata:Lesson Plan Text","Item Type Metadata:URL","Item Type Metadata:Event Type","Item Type Metadata:Participants","Item Type Metadata:Birth Date","Item Type Metadata:Birthplace","Item Type Metadata:Death Date","Item Type Metadata:Occupation","Item Type Metadata:Biographical Text","Item Type Metadata:Bibliography",tags,file,itemType,collection,public,featured
"Josué livre aux flammes la ville d'Haï.",,,,,,,,,,Planche,,"Gravure sur acier",1133_SAI_1_048_web,,,,,,,,,,,,,,,,,,,,,,,,,,,,,,,,,,,,"Aï (ville),Armée,Fumée,Incendie,Livre de Josué",https://hieronyma.ict-toulouse.fr/files/original/cb8c45859fe3f7ce9dd511a47be99378.JPG,"Image fixe","La Sainte Bible : traduction nouvelle selon la Vulgate",1,0
"Dieu fait alliance avec Abram",,,,,,,,,,"Image pleine page","français ; latin","Gravure sur cuivre",PAT_18G_001_021_web_b,,,,,,,,,,,,,,,,,,,,,,,,,,,,,,,,,,,,"Abraham,Alliance,Animal,Dieu le Père,Fumée,Livre de la Genèse,Nuit,Sacrifice,Sommeil,Torche",https://hieronyma.ict-toulouse.fr/files/original/270f70f35ae92853c0b659afb0b10554.JPG,,"L'Ancien et le Nouveau Testament représentés en cinq cens tableaux gravés d'après les desseins de Raphaël & autres grands maîtres et expliqués par les paroles de l'Ecriture",1,0
"Coré, Dathan et Abiron murmurateurs engloutis",,,,,,,,,,"Image mi-page","français ; latin","Gravure sur cuivre",PAT_18G_001_078_web_b,,,,,,,,,,,,,,,,,,,,,,,,,,,,,,,,,,,,"Abiron,Colonne,Coré,Dathan,Fumée,Le Tabernacle,Livre des Nombres,Moïse,Mort par le feu,Punition,Séisme",https://hieronyma.ict-toulouse.fr/files/original/95e51863fde30867b32057fdc1a2ae09.JPG,,"L'Ancien et le Nouveau Testament représentés en cinq cens tableaux gravés d'après les desseins de Raphaël & autres grands maîtres et expliqués par les paroles de l'Ecriture",1,0
"Caïn et Abel offrant leur sacrifice.",,,,,,,,,,Planche,,"Gravure sur acier",1133_SAI_1_004_web,,,,,,,,,,,,,,,,,,,,,,,,,,,,,,,,,,,,"Abel,Autel,Caïn,Fumée,Jalousie,Livre de la Genèse,Sacrifice",https://hieronyma.ict-toulouse.fr/files/original/5984ed10c0956378c6ed369393354f69.JPG,"Image fixe","La Sainte Bible : traduction nouvelle selon la Vulgate",1,0
"Altare holocausti",,,,,,,,,,"Image mi-page",,"Gravure sur bois",PAT_16G_069_013_web,,,,,,,,,,,,,,,,,,,,,,,,,,,,,,,,,,,,"Autel,Bélier,Flamme,Fumée,Mobilier biblique,Sacrifice,Tête",https://hieronyma.ict-toulouse.fr/files/original/6e301dbc4b08bde9f14ee5aa5db91a37.jpg,"Image fixe","Biblia sacra Veteris et Novi Testamenti...",1,0
"[Tobie et Sara en prière]",,,,,,,,,,Vignette,,"Gravure sur bois",PAT_16M_022_242_web,,,,,,,,,,,,,,,,,,,,,,,,,,,,,,,,,,,,"Agenouillé,Archange,Asmodée,Chambre,Cheminée,Combat,Extérieur,Fenêtre,Fumée,Intérieur,Livre de Tobie,Prière,Saint Raphaël,Sara femme de Tobie,Tobie",https://hieronyma.ict-toulouse.fr/files/original/977a8cdda56a026cfaa66afb02baf8cc.JPG,"Image fixe","[Bible, latin, 1574]",1,0
"[Les pouces du roi Adoni-Bézeq sont coupés. Apparition de l'ange à Bokim]",,,,,,,,,,"Pleine page",,"Gravure sur bois",PAT_16M_022_131_web,,,,,,,,,,,,,,,,,,,,,,,,,,,,,,,,,,,,"Adoni-Bézeq,Ange,Apparition,Autel,Couteau,Fumée,Livre des Juges,Mutilé,Pouce,Roi,Soldat",https://hieronyma.ict-toulouse.fr/files/original/9d2df32317ab89a1e3cf0e10877c5fe5.jpg,"Image fixe","[Bible, latin, 1574]",1,0
"[Le fléau des sauterelles à tête humaine et à queue de scorpion. La libération des quatre anges exterminateurs]",,,,,,,,,,Vignettes,latin,"Gravure sur bois",PAT_16M_022_436_web,,,,,,,,,,,,,,,,,,,,,,,,,,,,,,,,,,,,"Ange,Armée,Autel,Couronne,Dieu le Père,Douleur,Étoile,Feu,Fumée,Lion,Livre de l'Apocalypse,Massacre,Mort par le fer,Nuit,Puits,Sauterelle,Tête,Trompette,Vision",https://hieronyma.ict-toulouse.fr/files/original/730d146b970afa532a3c211b9822ebae.jpg,,"[Bible, latin, 1574]",1,0
[Cul-de-lampe],,,,,,,,,,"Ornement typographique",,"Gravure sur bois",PAT_18P_179_010_web,,,,,,,,,,,,,,,,,,,,,,,,,,,,,,,,,,,,"Couronne,Encensoir,Fumée,JEP2019",https://hieronyma.ict-toulouse.fr/files/original/915f8aa0ca1142cdf181d09272c56716.jpg,"Image fixe","La Henriade. 1787",1,0
"[Adam travaille la terre. Dieu favorise l'offrande d'Abel]",,,,,,,,,,"Pleine page",,"Gravure sur bois",PAT_16M_022_004_web,,,,,,,,,,,,,,,,,,,,,,,,,,,,,,,,,,,,"Abel,Adam,Allaitement,Allégorie,Autel,Caïn,Dieu le Père,Ève,Forêt,Fumée,Labour à bras,Livre de la Genèse,Mort,Nourrisson,Sacrifice,Squelette",https://hieronyma.ict-toulouse.fr/files/original/908a1dfc8554baea6dab44acd84c0d3d.jpg,"Image fixe","[Bible, latin, 1574]",1,0
