﻿"Dublin Core:Title","Dublin Core:Subject","Dublin Core:Description","Dublin Core:Creator","Dublin Core:Source","Dublin Core:Publisher","Dublin Core:Date","Dublin Core:Contributor","Dublin Core:Rights","Dublin Core:Relation","Dublin Core:Format","Dublin Core:Language","Dublin Core:Type","Dublin Core:Identifier","Dublin Core:Coverage","Item Type Metadata:Text","Item Type Metadata:Interviewer","Item Type Metadata:Interviewee","Item Type Metadata:Location","Item Type Metadata:Transcription","Item Type Metadata:Local URL","Item Type Metadata:Original Format","Item Type Metadata:Physical Dimensions","Item Type Metadata:Duration","Item Type Metadata:Compression","Item Type Metadata:Producer","Item Type Metadata:Director","Item Type Metadata:Bit Rate/Frequency","Item Type Metadata:Time Summary","Item Type Metadata:Email Body","Item Type Metadata:Subject Line","Item Type Metadata:From","Item Type Metadata:To","Item Type Metadata:CC","Item Type Metadata:BCC","Item Type Metadata:Number of Attachments","Item Type Metadata:Standards","Item Type Metadata:Objectives","Item Type Metadata:Materials","Item Type Metadata:Lesson Plan Text","Item Type Metadata:URL","Item Type Metadata:Event Type","Item Type Metadata:Participants","Item Type Metadata:Birth Date","Item Type Metadata:Birthplace","Item Type Metadata:Death Date","Item Type Metadata:Occupation","Item Type Metadata:Biographical Text","Item Type Metadata:Bibliography",tags,file,itemType,collection,public,featured
"David délivré des mains de Saul.",,,,,,,,,,"Image mi-page","français ; latin","Gravure sur cuivre",PAT_18G_001_108_web_b,,,,,,,,,,,,,,,,,,,,,,,,,,,,,,,,,,,,"Armée,David,Fuite,Messager,Montagne,Poursuite militaire,Premier Livre de Samuel,Saül",https://hieronyma.ict-toulouse.fr/files/original/433532b1f209cb7feef3b7436520749b.JPG,,"L'Ancien et le Nouveau Testament représentés en cinq cens tableaux gravés d'après les desseins de Raphaël & autres grands maîtres et expliqués par les paroles de l'Ecriture",1,0
"Defaite des V rois de Sodome de Gomorre, d'Adama, de Seboim, et de Bala",,,,,,,,,,"Image mi-page","français ; latin","Gravure sur cuivre",PAT_18G_001_019_web_b,,,,,,,,,,,,,,,,,,,,,,,,,,,,,,,,,,,,"Bataille,Cavalier,Chute,Défaite,Fuite,Livre de la Genèse,Mort,Roi",https://hieronyma.ict-toulouse.fr/files/original/91f6734a677fbe7735755d3655d8440a.JPG,,"L'Ancien et le Nouveau Testament représentés en cinq cens tableaux gravés d'après les desseins de Raphaël & autres grands maîtres et expliqués par les paroles de l'Ecriture",1,0
"Évasion de David.",,,,,,,,,,Planche,,"Gravure sur acier",1133_SAI_1_073_web,,,,,,,,,,,,,,,,,,,,,,,,,,,,,,,,,,,,"David,Fenêtre,Fuite,Lien,Michol,Premier Livre de Samuel",https://hieronyma.ict-toulouse.fr/files/original/50daedf2f1c8e8c6971ef52c4352d1a6.JPG,"Image fixe","La Sainte Bible : traduction nouvelle selon la Vulgate",1,0
"Fuite de Lot.",,,,,,,,,,Planche,,"Gravure sur acier",1133_SAI_1_013_web,,,,,,,,,,,,,,,,,,,,,,,,,,,,,,,,,,,,"Destruction,Femme,Fuite,Livre de la Genèse,Lot,Punition,Statue,Ville",https://hieronyma.ict-toulouse.fr/files/original/bd22600a6487a7ed57fdffcfb3b62dcd.JPG,"Image fixe","La Sainte Bible : traduction nouvelle selon la Vulgate",1,0
"Gédéon jette l'épouvante dans l'armée de Madian.",,,,,,,,,,Planche,,"Gravure sur acier",1133_SAI_1_055_web,,,,,,,,,,,,,,,,,,,,,,,,,,,,,,,,,,,,"Armée,Désert,Fuite,Livre des Juges,Nuit,Peur,Torche",https://hieronyma.ict-toulouse.fr/files/original/912153cbddc824497d320bd5d66cc7ab.JPG,"Image fixe","La Sainte Bible : traduction nouvelle selon la Vulgate",1,0
"La femme de l'Apocalypse poursuivie par le dragon",,,,,,,,,,"Image mi-page","français ; latin","Gravure sur cuivre",PAT_18G_001_245a,,,,,,,,,,,,,,,,,,,,,,,,,,,,,,,,,,,,"Aile,Animal fabuleux,Désert,Dragon,Femme,Fleuve,Fuite,Hybride,Livre de l'Apocalypse,Polycéphale,Vision",https://hieronyma.ict-toulouse.fr/files/original/66f2eb6329c8ac595a1ccc59025fd340.JPG,,"L'Ancien et le Nouveau Testament représentés en cinq cens tableaux gravés d'après les desseins de Raphaël & autres grands maîtres et expliqués par les paroles de l'Ecriture",1,0
"Michol fait sauver David.",,,,,,,,,,"Image mi-page","français ; latin","Gravure sur cuivre",PAT_18G_001_106_web_a,,,,,,,,,,,,,,,,,,,,,,,,,,,,,,,,,,,,"David,Fuite,Lien,Lit,Michol,Nuit,Premier Livre de Samuel,Soldat,Statue",https://hieronyma.ict-toulouse.fr/files/original/b836360f2456128948fef8edc275c7d2.JPG,,"L'Ancien et le Nouveau Testament représentés en cinq cens tableaux gravés d'après les desseins de Raphaël & autres grands maîtres et expliqués par les paroles de l'Ecriture",1,0
"Mort resuscité par l'attouchement des os d'Elisée.",,,,,,,,,,"Image mi-page","français ; latin","Gravure sur cuivre",PAT_18G_001_133b,,,,,,,,,,,,,,,,,,,,,,,,,,,,,,,,,,,,"Deuxième Livre des Rois,Élisée,Fuite,Miracle,Résurrection,Squelette,Tombeau",https://hieronyma.ict-toulouse.fr/files/original/9c6f30067b5b5014cf9d1eb4bb84940b.JPG,,"L'Ancien et le Nouveau Testament représentés en cinq cens tableaux gravés d'après les desseins de Raphaël & autres grands maîtres et expliqués par les paroles de l'Ecriture",1,0
"Moyse défend les filles du prêtre de Madian et en épouse une.",,,,,,,,,,"Image mi-page","français ; latin","Gravure sur cuivre",PAT_18G_001_051_web_a,,,,,,,,,,,,,,,,,,,,,,,,,,,,,,,,,,,,"Berger,Bétail,Femme,Fuite,Livre de l'Exode,Moïse,Puits,Secours",https://hieronyma.ict-toulouse.fr/files/original/e39092915a1df94c29b3518dbb04b1d3.JPG,,"L'Ancien et le Nouveau Testament représentés en cinq cens tableaux gravés d'après les desseins de Raphaël & autres grands maîtres et expliqués par les paroles de l'Ecriture",1,0
"N°10 : Praelium Diurnum. Battaly by daegh.",,,,,,,,,,Planche,,"Gravure sur cuivre",RES_17P_003_018_web,,,,,,,,,,,,,,,,,,,,,,,,,,,,,,,,,,,,"Barque,Bataille,Bateau à voiles,Canon,Espagnol,Fuite,Fumée,Hollandais,Jour,Marine,Mer,Naufrage,Océan Pacifique,Soleil",https://hieronyma.ict-toulouse.fr/files/original/c453d558ebf1c9d803bf9a70d1217709.jpg,"Image fixe","Speculum orientalis occidentalisque Indiae navigationum [...]",1,0
