﻿"Dublin Core:Title","Dublin Core:Subject","Dublin Core:Description","Dublin Core:Creator","Dublin Core:Source","Dublin Core:Publisher","Dublin Core:Date","Dublin Core:Contributor","Dublin Core:Rights","Dublin Core:Relation","Dublin Core:Format","Dublin Core:Language","Dublin Core:Type","Dublin Core:Identifier","Dublin Core:Coverage","Item Type Metadata:Text","Item Type Metadata:Interviewer","Item Type Metadata:Interviewee","Item Type Metadata:Location","Item Type Metadata:Transcription","Item Type Metadata:Local URL","Item Type Metadata:Original Format","Item Type Metadata:Physical Dimensions","Item Type Metadata:Duration","Item Type Metadata:Compression","Item Type Metadata:Producer","Item Type Metadata:Director","Item Type Metadata:Bit Rate/Frequency","Item Type Metadata:Time Summary","Item Type Metadata:Email Body","Item Type Metadata:Subject Line","Item Type Metadata:From","Item Type Metadata:To","Item Type Metadata:CC","Item Type Metadata:BCC","Item Type Metadata:Number of Attachments","Item Type Metadata:Standards","Item Type Metadata:Objectives","Item Type Metadata:Materials","Item Type Metadata:Lesson Plan Text","Item Type Metadata:URL","Item Type Metadata:Event Type","Item Type Metadata:Participants","Item Type Metadata:Birth Date","Item Type Metadata:Birthplace","Item Type Metadata:Death Date","Item Type Metadata:Occupation","Item Type Metadata:Biographical Text","Item Type Metadata:Bibliography",tags,file,itemType,collection,public,featured
"Beste monstrueuse a laquelle le dragon donne sa puissance.",,,,,,,,,,"Image mi-page","français ; latin","Gravure sur cuivre",PAT_18G_001_241b,,,,,,,,,,,,,,,,,,,,,,,,,,,,,,,,,,,,"Animal fabuleux,Dragon,Foule,Hybride,Livre de l'Apocalypse,Polycéphale,Prière,Satan,Zoomorphe",https://hieronyma.ict-toulouse.fr/files/original/c4fcd3eca1aa87ccbd6b10f11c2d76fc.JPG,,"L'Ancien et le Nouveau Testament représentés en cinq cens tableaux gravés d'après les desseins de Raphaël & autres grands maîtres et expliqués par les paroles de l'Ecriture",1,0
Crucifiement.,,,,,,,,,,Planche,,"Gravure sur acier",1133_SAI_2_085_web,,,,,,,,,,,,,,,,,,,,,,,,,,,,,,,,,,,,"Christ,Évangile selon saint Jean,Foule,Jésus cloué sur la Croix,La Croix,Le Crucifiement,Les larrons,Passion,Soldat,Vierge",https://hieronyma.ict-toulouse.fr/files/original/8ae82d85366eb4303ca5f751001429d1.JPG,,"La Sainte Bible : traduction nouvelle selon la Vulgate",1,0
"Dénombrement de la Judée par édit d'Auguste",,,,,,,,,,"Image mi-page","français ; latin","Gravure sur cuivre",PAT_18G_001_169a,,,,,,,,,,,,,,,,,,,,,,,,,,,,,,,,,,,,"Écriture,Évangile selon saint Luc,Foule,Grossesse,Recensement,Saint Joseph,Vierge",https://hieronyma.ict-toulouse.fr/files/original/39d2bfdbc46c02672f23bbc258d7aa26.JPG,,"L'Ancien et le Nouveau Testament représentés en cinq cens tableaux gravés d'après les desseins de Raphaël & autres grands maîtres et expliqués par les paroles de l'Ecriture",1,0
"Douze colomnes elevées par Moyse",,,,,,,,,,"Image mi-page","français ; latin","Gravure sur cuivre",PAT_18G_001_063_web_b,,,,,,,,,,,,,,,,,,,,,,,,,,,,,,,,,,,,"Autel,Colonne,Foule,Livre de l'Exode,Moïse,Sacrifice",https://hieronyma.ict-toulouse.fr/files/original/50763750ecbeb90d7b0304c941ccfbdb.JPG,,"L'Ancien et le Nouveau Testament représentés en cinq cens tableaux gravés d'après les desseins de Raphaël & autres grands maîtres et expliqués par les paroles de l'Ecriture",1,0
"Entrée de Jésus à Jérusalem.",,,,,,,,,,Planche,,"Gravure sur acier",1133_SAI_2_070_web,,,,,,,,,,,,,,,,,,,,,,,,,,,,,,,,,,,,"Âne,Branche,Christ,Entrée à Jérusalem,Évangile selon saint Matthieu,Foule,Jérusalem,Petit d'animal,Prosterné",https://hieronyma.ict-toulouse.fr/files/original/07a1723f887b7d049468afd91d17e109.JPG,,"La Sainte Bible : traduction nouvelle selon la Vulgate",1,0
"Guérison d'un lepreux apres le sermon sur la montagne",,,,,,,,,,"Image mi-page","français ; latin","Gravure sur cuivre",PAT_18G_001_181b,,,,,,,,,,,,,,,,,,,,,,,,,,,,,,,,,,,,"Bord de mer,Christ,Évangile selon saint Matthieu,Foule,Jésus guérissant,Lèpre,Maladie,Montagne",https://hieronyma.ict-toulouse.fr/files/original/0e119a0ce53a8eeb91fbddabaf07c65a.JPG,,"L'Ancien et le Nouveau Testament représentés en cinq cens tableaux gravés d'après les desseins de Raphaël & autres grands maîtres et expliqués par les paroles de l'Ecriture",1,0
"Guérison d'un paralytique.",,,,,,,,,,"Image mi-page","français ; latin","Gravure sur cuivre",PAT_18G_001_183b,,,,,,,,,,,,,,,,,,,,,,,,,,,,,,,,,,,,"Évangile selon saint Marc,Foule,Intérieur,Jésus guérissant,Maison,Paralysé",https://hieronyma.ict-toulouse.fr/files/original/99b1137d8a857562c72742caf90d8273.JPG,,"L'Ancien et le Nouveau Testament représentés en cinq cens tableaux gravés d'après les desseins de Raphaël & autres grands maîtres et expliqués par les paroles de l'Ecriture",1,0
"Guérison du lunatique.",,,,,,,,,,Planche,,"Gravure sur acier",1133_SAI_2_059_web,,,,,,,,,,,,,,,,,,,,,,,,,,,,,,,,,,,,"Christ,Délivrance de possédé,Évangile selon saint Matthieu,Foule,Jésus guérissant,Miracle du Christ",https://hieronyma.ict-toulouse.fr/files/original/a44d2ae379391a4442a4e0aee16d4c9a.JPG,,"La Sainte Bible : traduction nouvelle selon la Vulgate",1,0
"Herode frappé de mort par un ange",,,,,,,,,,"Image mi-page","français ; latin","Gravure sur cuivre",PAT_18G_001_232a,,,,,,,,,,,,,,,,,,,,,,,,,,,,,,,,,,,,"Actes des Apôtres,Ange,Foule,Hérode Antipas,Mort,Punition,Trône",https://hieronyma.ict-toulouse.fr/files/original/03a1511ed437f2ed0b3407be001cda7f.JPG,,"L'Ancien et le Nouveau Testament représentés en cinq cens tableaux gravés d'après les desseins de Raphaël & autres grands maîtres et expliqués par les paroles de l'Ecriture",1,0
"Impotent de Lystre gueri par St Paul",,,,,,,,,,"Image mi-page","français ; latin","Gravure sur cuivre",PAT_18G_001_233b,,,,,,,,,,,,,,,,,,,,,,,,,,,,,,,,,,,,"Actes des Apôtres,Foule,Guérison miraculeuse,Infirme,Miracle,Saint Barnabé,Saint Paul de Tarse",https://hieronyma.ict-toulouse.fr/files/original/b8ac513d6cdee183f42e64aeae792d09.JPG,,"L'Ancien et le Nouveau Testament représentés en cinq cens tableaux gravés d'après les desseins de Raphaël & autres grands maîtres et expliqués par les paroles de l'Ecriture",1,0
