﻿"Dublin Core:Title","Dublin Core:Subject","Dublin Core:Description","Dublin Core:Creator","Dublin Core:Source","Dublin Core:Publisher","Dublin Core:Date","Dublin Core:Contributor","Dublin Core:Rights","Dublin Core:Relation","Dublin Core:Format","Dublin Core:Language","Dublin Core:Type","Dublin Core:Identifier","Dublin Core:Coverage","Item Type Metadata:Text","Item Type Metadata:Interviewer","Item Type Metadata:Interviewee","Item Type Metadata:Location","Item Type Metadata:Transcription","Item Type Metadata:Local URL","Item Type Metadata:Original Format","Item Type Metadata:Physical Dimensions","Item Type Metadata:Duration","Item Type Metadata:Compression","Item Type Metadata:Producer","Item Type Metadata:Director","Item Type Metadata:Bit Rate/Frequency","Item Type Metadata:Time Summary","Item Type Metadata:Email Body","Item Type Metadata:Subject Line","Item Type Metadata:From","Item Type Metadata:To","Item Type Metadata:CC","Item Type Metadata:BCC","Item Type Metadata:Number of Attachments","Item Type Metadata:Standards","Item Type Metadata:Objectives","Item Type Metadata:Materials","Item Type Metadata:Lesson Plan Text","Item Type Metadata:URL","Item Type Metadata:Event Type","Item Type Metadata:Participants","Item Type Metadata:Birth Date","Item Type Metadata:Birthplace","Item Type Metadata:Death Date","Item Type Metadata:Occupation","Item Type Metadata:Biographical Text","Item Type Metadata:Bibliography",tags,file,itemType,collection,public,featured
"Sainte Rose de Lima",,,,,,,,,,Planche,,"Gravure sur acier",IE_447_013_web,,,,,,,,,,,,,,,,,,,,,,,,,,,,,,,,,,,,"Fontaine,Portrait,Sainte Rose de Lima",https://hieronyma.ict-toulouse.fr/files/original/84aa0bfa24856b5427114f0a114bcb66.jpg,"Image fixe","Les Saintes femmes",1,0
"Liv. 19 : Telemaque entre dans les Champs Elisées, où il est reconnu par Acrise son Grand-Pere.",,,,,,,,,,Planche,français,"Gravure sur cuivre",FD_487-2_007_web,,,,,,,,,,,,,,,,,,,,,,,,,,,,,,,,,,,,"Encensoir,Famille,Fontaine,Jardin,Les champs Elysées,Roi,Télémaque",https://hieronyma.ict-toulouse.fr/files/original/024277d00403e3c907f86f2febf689ee.jpg,,"Les aventures de Télémaque, fils d'Ulysse",1,0
"L'inceste de Thamar avec Juda",,,,,,,,,,"Image mi-page","français ; latin","Gravure sur cuivre",PAT_18G_001_039_web_b,,,,,,,,,,,,,,,,,,,,,,,,,,,,,,,,,,,,"Bâton,Chemin,Don,Étreinte,Fontaine,Juda fils de Jacob,Livre de la Genèse,Thamar",https://hieronyma.ict-toulouse.fr/files/original/a37d5ebbd4e2c01c49962894debc9f75.JPG,,"L'Ancien et le Nouveau Testament représentés en cinq cens tableaux gravés d'après les desseins de Raphaël & autres grands maîtres et expliqués par les paroles de l'Ecriture",1,0
"Isaac et Rabecca",,,,,,,,,,"Image mi-page","français ; latin","Gravure sur cuivre",PAT_18G_001_029_web_b,,,,,,,,,,,,,,,,,,,,,,,,,,,,,,,,,,,,"Abimélek,Étreinte,Fontaine,Isaac,Livre de la Genèse,Rébecca,Roi",https://hieronyma.ict-toulouse.fr/files/original/b253911c64149c6c884a38ed7cff6e18.JPG,,"L'Ancien et le Nouveau Testament représentés en cinq cens tableaux gravés d'après les desseins de Raphaël & autres grands maîtres et expliqués par les paroles de l'Ecriture",1,0
"Deux vieillards attentent a la pudeur de Suzanne.",,,,,,,,,,"Image mi-page","français ; latin","Gravure sur cuivre",PAT_18G_001_149b,,,,,,,,,,,,,,,,,,,,,,,,,,,,,,,,,,,,"Agression,Baignade,Bain,Fontaine,Jardin,Livre de Daniel,Nudité,Suzanne,Vieux",https://hieronyma.ict-toulouse.fr/files/original/7884417822b3c2b438f4ad6c1ca29ccd.JPG,,"L'Ancien et le Nouveau Testament représentés en cinq cens tableaux gravés d'après les desseins de Raphaël & autres grands maîtres et expliqués par les paroles de l'Ecriture",1,0
"D'un Cerf pris par son bois.",,,,,,,,,,Vignette,,"Gravure sur cuivre",PAT_17P_547_012_web,,,,,,,,,,,,,,,,,,,,,,,,,,,,,,,,,,,,"Animal,Cerf,Chasse à courre,Chien,Fable,Fontaine,Forêt,Fuite,Reflet",https://hieronyma.ict-toulouse.fr/files/original/b76fa0355e335d74d735a8d889ac537a.JPG,"Image fixe","Esope en belle humeur",1,0
"Autel des holocaustes, cuve d'airain.",,,,,,,,,,"Image mi-page","français ; latin","Gravure sur cuivre",PAT_18G_001_069_web_a,,,,,,,,,,,,,,,,,,,,,,,,,,,,,,,,,,,,"Autel,Fontaine,Livre de l'Exode,Mobilier biblique,Sacrifice,Vase",https://hieronyma.ict-toulouse.fr/files/original/0be3db191833afa434aaa30b7e8f221f.JPG,,"L'Ancien et le Nouveau Testament représentés en cinq cens tableaux gravés d'après les desseins de Raphaël & autres grands maîtres et expliqués par les paroles de l'Ecriture",1,0
"Agar et Ismael son fils dans le desert",,,,,,,,,,"Image mi-page","français ; latin","Gravure sur cuivre",PAT_18G_001_025_web_b,,,,,,,,,,,,,,,,,,,,,,,,,,,,,,,,,,,,"Agar,Ange,Apparition,Arbre,Désert,Fontaine,Ismaël,Livre de la Genèse",https://hieronyma.ict-toulouse.fr/files/original/f0669ceb1c25cfc964e7fca04344271a.JPG,,"L'Ancien et le Nouveau Testament représentés en cinq cens tableaux gravés d'après les desseins de Raphaël & autres grands maîtres et expliqués par les paroles de l'Ecriture",1,0
"[Suzanne et les vieillards]",,,,,,,,,,Vignette,,"Gravure sur bois",PAT_16M_022_269_web,,,,,,,,,,,,,,,,,,,,,,,,,,,,,,,,,,,,"Agression,Baignade,Fontaine,Jardin,Livre de Daniel,Nudité,Suzanne,Vieux",https://hieronyma.ict-toulouse.fr/files/original/04a3a9fac5aa9a29d0d44c6599dd0089.jpg,"Image fixe","[Bible, latin, 1574]",1,0
"[Salon d'un palais]",,,,,,,,,,Planche,,"Gravure sur cuivre",PAT_18P_280-8_015_web,,,,,,,,,,,,,,,,,,,,,,,,,,,,,,,,,,,,"Fontaine,Intérieur,Iran,Ispahan,Palais",https://hieronyma.ict-toulouse.fr/files/original/f73380ab914954f219457ee665c971b7.JPG,"Image fixe","Voyages de Mr. Le Chevalier Chardin, en Perse, et autres lieux de l'Orient. Tome Huitième",1,0
