﻿"Dublin Core:Title","Dublin Core:Subject","Dublin Core:Description","Dublin Core:Creator","Dublin Core:Source","Dublin Core:Publisher","Dublin Core:Date","Dublin Core:Contributor","Dublin Core:Rights","Dublin Core:Relation","Dublin Core:Format","Dublin Core:Language","Dublin Core:Type","Dublin Core:Identifier","Dublin Core:Coverage","Item Type Metadata:Text","Item Type Metadata:Interviewer","Item Type Metadata:Interviewee","Item Type Metadata:Location","Item Type Metadata:Transcription","Item Type Metadata:Local URL","Item Type Metadata:Original Format","Item Type Metadata:Physical Dimensions","Item Type Metadata:Duration","Item Type Metadata:Compression","Item Type Metadata:Producer","Item Type Metadata:Director","Item Type Metadata:Bit Rate/Frequency","Item Type Metadata:Time Summary","Item Type Metadata:Email Body","Item Type Metadata:Subject Line","Item Type Metadata:From","Item Type Metadata:To","Item Type Metadata:CC","Item Type Metadata:BCC","Item Type Metadata:Number of Attachments","Item Type Metadata:Standards","Item Type Metadata:Objectives","Item Type Metadata:Materials","Item Type Metadata:Lesson Plan Text","Item Type Metadata:URL","Item Type Metadata:Event Type","Item Type Metadata:Participants","Item Type Metadata:Birth Date","Item Type Metadata:Birthplace","Item Type Metadata:Death Date","Item Type Metadata:Occupation","Item Type Metadata:Biographical Text","Item Type Metadata:Bibliography",tags,file,itemType,collection,public,featured
"Arbrisseau de Thé",,,,,,,,,,Planche,français,"Gravure sur cuivre",ID_130-1_022_web,,,,,,,,,,,,,,,,,,,,,,,,,,,,,,,,,,,,"Botanique,Branche,Camellia sinensis,Fleur,Fruit,Japon,Théier",https://hieronyma.ict-toulouse.fr/files/original/0a5513b14593602bfebf0a67d1d602f4.JPG,"Image fixe","Histoire du Japon",1,0
[Fleuron],,,,,,,,,,"Ornement typographique",,"Gravure sur bois",CAP_17G_046_047_web,,,,,,,,,,,,,,,,,,,,,,,,,,,,,,,,,,,,"Fleur,Plante",https://hieronyma.ict-toulouse.fr/files/original/e63fb09af84e7e4453eb662fd6caff6c.JPG,"Image fixe","La Sainte Bible",1,0
"[Marque d'imprimeur]",,"Inscription dans le cadre : ""A l aventure tout vient a point qui peut atendre"".",,,,,,,,"Marque d'imprimeur",,"Gravure sur bois",RES_16P_004_001_web,,,,,,,,,,,,,,,,,,,,,,,,,,,,,,,,,,,,"Animal,Animal fabuleux,Arbre,Fleur,Griffon",https://hieronyma.ict-toulouse.fr/files/original/512c0a47da594fafa14df062e5d98d78.jpg,"Image fixe","Celeberrimi ac moralissimi sacre pagine doctoris Magistri Roberti Holkot Alemani [...]",1,1
"403. La Perce-neige ou Leucoie printanier. 405. Le Narcisse faux Narcisse.",,,,,,,,,,Vignette,,"Gravure sur bois",X_447_004_web,,,,,,,,,,,,,,,,,,,,,,,,,,,,,,,,,,,,"Botanique,Fleur,Leucojum vernum,Narcisse jaune,Narcissus pseudonarcissus,Nivéole de printemps,Plante",https://hieronyma.ict-toulouse.fr/files/original/f6dff3f8358bb7beae3cce0e9eaefe21.jpg,"Image fixe","Histoire des plantes d'Europe",1,0
"912. La Mauve alcée. 913. L'Alcée rose, ou trémiere",,,,,,,,,,Vignette,,"Gravure sur bois",X_447_006_web,,,,,,,,,,,,,,,,,,,,,,,,,,,,,,,,,,,,"Alcea rosea,Botanique,Fleur,Malva alcea,Mauve alcée,Passe-rose,Plante",https://hieronyma.ict-toulouse.fr/files/original/a984eba0efbc6d085148b65cff825376.jpg,"Image fixe","Histoire des plantes d'Europe",1,1
"1168. L'Archilliere sternutatoire. 1169. L'Achilliere millefeuilles.",,,,,,,,,,Vignette,,"Gravure sur bois",X_447_007_web,,,,,,,,,,,,,,,,,,,,,,,,,,,,,,,,,,,,"Achillea millefolium,Achillea ptarmica,Achillée millefeuille,Achillée ptarmique,Botanique,Fleur,Plante",https://hieronyma.ict-toulouse.fr/files/original/43b721b8f517f5fcddf82db1a18f5962.jpg,"Image fixe","Histoire des plantes d'Europe",1,0
"Direction des Branches. Les differentes parties des Fleurs",,,,,,,,,,"Image pleine page",,"Gravure sur cuivre",X_348_027_web,,,,,,,,,,,,,,,,,,,,,,,,,,,,,,,,,,,,"Arbre,Botanique,Branche,Fleur,Partie de végétal",https://hieronyma.ict-toulouse.fr/files/original/ba33f3d86b13f1825eed8516ef3fbc3d.jpg,"Image fixe","Le Spectacle de la Nature",1,0
"[Lettre R]",,,,,,,,,,"Initiale ornée",,"Gravure sur bois",RES_16P_005_004_web,,,,,,,,,,,,,,,,,,,,,,,,,,,,,,,,,,,,"Fleur,Lettre R,Plante",https://hieronyma.ict-toulouse.fr/files/original/282875086112289bf325ce6deb7e8b19.jpg,"Image fixe","Historia scholastica",1,0
"[Lettre I]",,,,,,,,,,"Initiale ornée",,"Gravure sur bois",RES_16P_005_005_web,,,,,,,,,,,,,,,,,,,,,,,,,,,,,,,,,,,,"Fleur,Lettre I,Plante",https://hieronyma.ict-toulouse.fr/files/original/e9b06c8a7af8507d07dffe8bb36b8f05.jpg,"Image fixe","Historia scholastica",1,0
"[Lettre T]",,,,,,,,,,"Initiale ornée",,"Gravure sur bois",RES_16P_005_006_web,,,,,,,,,,,,,,,,,,,,,,,,,,,,,,,,,,,,"Fleur,Lettre T",https://hieronyma.ict-toulouse.fr/files/original/2a119e5bc4a090614721eb77571861e0.jpg,"Image fixe","Historia scholastica",1,0
