﻿"Dublin Core:Title","Dublin Core:Subject","Dublin Core:Description","Dublin Core:Creator","Dublin Core:Source","Dublin Core:Publisher","Dublin Core:Date","Dublin Core:Contributor","Dublin Core:Rights","Dublin Core:Relation","Dublin Core:Format","Dublin Core:Language","Dublin Core:Type","Dublin Core:Identifier","Dublin Core:Coverage","Item Type Metadata:Text","Item Type Metadata:Interviewer","Item Type Metadata:Interviewee","Item Type Metadata:Location","Item Type Metadata:Transcription","Item Type Metadata:Local URL","Item Type Metadata:Original Format","Item Type Metadata:Physical Dimensions","Item Type Metadata:Duration","Item Type Metadata:Compression","Item Type Metadata:Producer","Item Type Metadata:Director","Item Type Metadata:Bit Rate/Frequency","Item Type Metadata:Time Summary","Item Type Metadata:Email Body","Item Type Metadata:Subject Line","Item Type Metadata:From","Item Type Metadata:To","Item Type Metadata:CC","Item Type Metadata:BCC","Item Type Metadata:Number of Attachments","Item Type Metadata:Standards","Item Type Metadata:Objectives","Item Type Metadata:Materials","Item Type Metadata:Lesson Plan Text","Item Type Metadata:URL","Item Type Metadata:Event Type","Item Type Metadata:Participants","Item Type Metadata:Birth Date","Item Type Metadata:Birthplace","Item Type Metadata:Death Date","Item Type Metadata:Occupation","Item Type Metadata:Biographical Text","Item Type Metadata:Bibliography",tags,file,itemType,collection,public,featured
[Fleuron],,,,,,,,,,"Ornement typographique",,"Gravure sur bois",CAP_17G_046_047_web,,,,,,,,,,,,,,,,,,,,,,,,,,,,,,,,,,,,"Fleur,Plante",https://hieronyma.ict-toulouse.fr/files/original/e63fb09af84e7e4453eb662fd6caff6c.JPG,"Image fixe","La Sainte Bible",1,0
[Fleuron],,,,,,,,,,"Ornement typographique",,"Gravure sur bois",CAP_17M_056_001_web,,,,,,,,,,,,,,,,,,,,,,,,,,,,,,,,,,,,"Corbeille,Fleur",https://hieronyma.ict-toulouse.fr/files/original/94a9ad8124b4e6164ea15effd6ff522a.jpg,"Image fixe","Cérémonial des religieuses",1,0
[Fleuron],,,,,,,,,,"Ornement typographique",français,"Gravure sur bois",PAT_17G_193_014_web,,,,,,,,,,,,,,,,,,,,,,,,,,,,,,,,,,,,"Fleur,Fruit,Panier",https://hieronyma.ict-toulouse.fr/files/original/48e6cea41989cfbe5dc6c786e8344756.jpg,,"Les Fleurs des Vies des saints... [1678]",1,0
[Fleuron],,,,,,,,,,"Ornement typographique",,"Gravure sur bois",PAT_17G_193_019_web,,,,,,,,,,,,,,,,,,,,,,,,,,,,,,,,,,,,"Élément végétal,Fleur,Fruit",https://hieronyma.ict-toulouse.fr/files/original/d72199ab46521daa6a492e25c9a0d5b6.jpg,,"Les Fleurs des Vies des saints... [1678]",1,0
"[Frontispice] Clémence Isaure, institutrice des Jeux floraux",,,,,,,,,,"Image pleine page",,"Gravure sur cuivre",PAT_18P_294_001_web,,,,,,,,,,,,,,,,,,,,,,,,,,,,,,,,,,,,"Bouquet,Clémence Isaure,Coiffe,En pied,Femme,Fleur,Robe,Statue",https://hieronyma.ict-toulouse.fr/files/original/d80fac29a034b43474220ef1e07701af.jpg,"Image fixe","Histoire de l'Académie des Jeux Floraux",1,1
"[Lettre A]",,,,,,,,,,"Initiale ornée",latin,"Gravure sur bois",Compendium_1519_002_web,,,,,,,,,,,,,,,,,,,,,,,,,,,,,,,,,,,,"Fleur,Lettre A,Ornement à forme végétale",https://hieronyma.ict-toulouse.fr/files/original/e1626e3462c520be48c7fc2d03405c97.jpg,,"Compendium totius sacrae scripture divinum Apiarium nuncupatum",1,0
"[Lettre A]",,,,,,,,,,"Initiale ornée",latin,"Gravure sur bois",Compendium_1519_023_web,,,,,,,,,,,,,,,,,,,,,,,,,,,,,,,,,,,,"Fleur,Lettre A,Main,Rose",https://hieronyma.ict-toulouse.fr/files/original/421d712f23811874a9949b28c2371a1c.jpg,,"Compendium totius sacrae scripture divinum Apiarium nuncupatum",1,0
"[Lettre C]",,,,,,,,,,"Initiale ornée",,"Gravure sur bois",PAT_16M_027_008_web,,,,,,,,,,,,,,,,,,,,,,,,,,,,,,,,,,,,"Fleur,Lettre C,Raisin",https://hieronyma.ict-toulouse.fr/files/original/fb423ad853bddff47ff81ba0850f1ad9.jpg,"Image fixe","Lettres de Sainte Catherine de Sienne",1,0
"[Lettre E]",,,,,,,,,,"Initiale ornée",français,"Gravure sur bois",PAT_17M_191_086_web,,,,,,,,,,,,,,,,,,,,,,,,,,,,,,,,,,,,"Fleur,Hybride,Lettre E",https://hieronyma.ict-toulouse.fr/files/original/d1abce4987ed629200eac594f9841fdd.jpg,,"Recueil des Roys de France... 1606",1,0
"[Lettre I]",,,,,,,,,,"Initiale ornée",,"Gravure sur bois",RES_16P_005_005_web,,,,,,,,,,,,,,,,,,,,,,,,,,,,,,,,,,,,"Fleur,Lettre I,Plante",https://hieronyma.ict-toulouse.fr/files/original/e9b06c8a7af8507d07dffe8bb36b8f05.jpg,"Image fixe","Historia scholastica",1,0
