﻿"Dublin Core:Title","Dublin Core:Subject","Dublin Core:Description","Dublin Core:Creator","Dublin Core:Source","Dublin Core:Publisher","Dublin Core:Date","Dublin Core:Contributor","Dublin Core:Rights","Dublin Core:Relation","Dublin Core:Format","Dublin Core:Language","Dublin Core:Type","Dublin Core:Identifier","Dublin Core:Coverage","Item Type Metadata:Text","Item Type Metadata:Interviewer","Item Type Metadata:Interviewee","Item Type Metadata:Location","Item Type Metadata:Transcription","Item Type Metadata:Local URL","Item Type Metadata:Original Format","Item Type Metadata:Physical Dimensions","Item Type Metadata:Duration","Item Type Metadata:Compression","Item Type Metadata:Producer","Item Type Metadata:Director","Item Type Metadata:Bit Rate/Frequency","Item Type Metadata:Time Summary","Item Type Metadata:Email Body","Item Type Metadata:Subject Line","Item Type Metadata:From","Item Type Metadata:To","Item Type Metadata:CC","Item Type Metadata:BCC","Item Type Metadata:Number of Attachments","Item Type Metadata:Standards","Item Type Metadata:Objectives","Item Type Metadata:Materials","Item Type Metadata:Lesson Plan Text","Item Type Metadata:URL","Item Type Metadata:Event Type","Item Type Metadata:Participants","Item Type Metadata:Birth Date","Item Type Metadata:Birthplace","Item Type Metadata:Death Date","Item Type Metadata:Occupation","Item Type Metadata:Biographical Text","Item Type Metadata:Bibliography",tags,file,itemType,collection,public,featured
Salomon.,,,,,,,,,,Planche,,"Gravure sur acier",1133_SAI_1_087_web,,,,,,,,,,,,,,,,,,,,,,,,,,,,,,,,,,,,"Écriture,Feuillet,Instrument d'écriture,Portrait,Premier Livre des Rois,Salomon",https://hieronyma.ict-toulouse.fr/files/original/68c5e218cb3cbe8b0e5c1b75c60d6e08.JPG,"Image fixe","La Sainte Bible : traduction nouvelle selon la Vulgate",1,0
"Art d'Ecrire",,,,,,,,,,"Image pleine page",,"Gravure sur cuivre",ENC_1783_PAN_000_web,,,,,,,,,,,,,,,,,,,,,,,,,,,,,,,,,,,,"Assis,Écriture,Encrier,Fauteuil,Feuillet,Homme,Instrument d'écriture,Intérieur,JEP2019,Livre,Matériel d'écriture,Rouleau,Table",https://hieronyma.ict-toulouse.fr/files/original/ce5944c28a05c1f61c09dca6fbca0cf2.jpg,"Image fixe","Encyclopédie méthodique",1,1
"Art d'Ecrire",,,,,,,,,,"Image pleine page",,"Gravure sur cuivre",ENC_1783_PAN_001_web,,,,,,,,,,,,,,,,,,,,,,,,,,,,,,,,,,,,"Assis,Écriture,Encrier,Fauteuil,Femme,Feuillet,Instrument d'écriture,Intérieur,JEP2019,Matériel d'écriture,Table",https://hieronyma.ict-toulouse.fr/files/original/86372d0386cbf8f017fff5a38623b195.jpg,"Image fixe","Encyclopédie méthodique",1,1
"Jésus parmi les docteurs",,,,,,,,,,Planche,,"Gravure sur acier",1133_SAI_2_039_web,,,,,,,,,,,,,,,,,,,,,,,,,,,,,,,,,,,,"Enfance du Christ,Enfant Jésus,Évangile selon saint Luc,Feuillet,Jésus et les Docteurs,Le Temple,Livre manuscrit,Savant",https://hieronyma.ict-toulouse.fr/files/original/756bab9bb081a06ebba5c624b863c253.JPG,,"La Sainte Bible : traduction nouvelle selon la Vulgate",1,0
"Jésus dans la synagogue.",,,,,,,,,,Planche,,"Gravure sur acier",1133_SAI_2_045_web,,,,,,,,,,,,,,,,,,,,,,,,,,,,,,,,,,,,"Christ,Évangile selon saint Luc,Feuillet,Intérieur,Lecture,Prédication,Rouleau,Synagogue",https://hieronyma.ict-toulouse.fr/files/original/cb2d8a3631a8ba6e92dff974ea7c1a37.JPG,,"La Sainte Bible : traduction nouvelle selon la Vulgate",1,0
"Gregorius VIII PP Beneven",,,,,,,,,,"Image pleine page",latin,"Gravure sur cuivre ; Gravure sur bois",C_2243_181_web,,,,,,,,,,,,,,,,,,,,,,,,,,,,,,,,,,,,"Armoiries,Chape,Feuillet,Grégoire VIII (pape, 110?-1187),Lecture,Pape,Portrait,Tiare",https://hieronyma.ict-toulouse.fr/files/original/a11a7350d5e834a9037d53638feb6986.JPG,,"Le vite de pontefici",1,0
"Pl. 1 : Imprimerie en Lettres, L'Opération de la casse",,"Composition avec les caractères d'imprimerie : ""Gloire à DIEU. Honneur au ROI. Salut aux Armes.""",,,,,,,,Planche,français,"Gravure sur cuivre",Ency_1785_Impr_000_web,,,,,,,,,,,,,,,,,,,,,,,,,,,,,,,,,,,,"Atelier,Feuillet,Imprimerie,Ouvrier,Signe alphabétique",https://hieronyma.ict-toulouse.fr/files/original/bfb6e5eaef7342f65fd49c55ebc94577.jpg,,"[L'Encyclopédie. Planches]",1,0
"Pl. 7 : Imprimerie, Impositions.",,,,,,,,,,Planche,français,"Gravure sur cuivre",Ency_1785_Impr_006_web,,,,,,,,,,,,,,,,,,,,,,,,,,,,,,,,,,,,"Feuillet,Imprimerie",https://hieronyma.ict-toulouse.fr/files/original/e473eda2005633cf0455c6ef8a9013af.jpg,,"[L'Encyclopédie. Planches]",1,0
"Pl. 8 : Imprimerie, Impositions.",,,,,,,,,,Planche,français,"Gravure sur cuivre",Ency_1785_Impr_007_web,,,,,,,,,,,,,,,,,,,,,,,,,,,,,,,,,,,,"Feuillet,Imprimerie",https://hieronyma.ict-toulouse.fr/files/original/2202ed634359bb84730714350a63a660.jpg,,"[L'Encyclopédie. Planches]",1,0
"Pl. 9 : Imprimerie, Impositions.",,,,,,,,,,Planche,français,"Gravure sur cuivre",Ency_1785_Impr_008_web,,,,,,,,,,,,,,,,,,,,,,,,,,,,,,,,,,,,"Feuillet,Imprimerie",https://hieronyma.ict-toulouse.fr/files/original/0dcd61276a029ff2a8764b2b6550b796.jpg,,"[L'Encyclopédie. Planches]",1,0
