﻿"Dublin Core:Title","Dublin Core:Subject","Dublin Core:Description","Dublin Core:Creator","Dublin Core:Source","Dublin Core:Publisher","Dublin Core:Date","Dublin Core:Contributor","Dublin Core:Rights","Dublin Core:Relation","Dublin Core:Format","Dublin Core:Language","Dublin Core:Type","Dublin Core:Identifier","Dublin Core:Coverage","Item Type Metadata:Text","Item Type Metadata:Interviewer","Item Type Metadata:Interviewee","Item Type Metadata:Location","Item Type Metadata:Transcription","Item Type Metadata:Local URL","Item Type Metadata:Original Format","Item Type Metadata:Physical Dimensions","Item Type Metadata:Duration","Item Type Metadata:Compression","Item Type Metadata:Producer","Item Type Metadata:Director","Item Type Metadata:Bit Rate/Frequency","Item Type Metadata:Time Summary","Item Type Metadata:Email Body","Item Type Metadata:Subject Line","Item Type Metadata:From","Item Type Metadata:To","Item Type Metadata:CC","Item Type Metadata:BCC","Item Type Metadata:Number of Attachments","Item Type Metadata:Standards","Item Type Metadata:Objectives","Item Type Metadata:Materials","Item Type Metadata:Lesson Plan Text","Item Type Metadata:URL","Item Type Metadata:Event Type","Item Type Metadata:Participants","Item Type Metadata:Birth Date","Item Type Metadata:Birthplace","Item Type Metadata:Death Date","Item Type Metadata:Occupation","Item Type Metadata:Biographical Text","Item Type Metadata:Bibliography",tags,file,itemType,collection,public,featured
"[Dieu s'adresse à Moïse. Dieu apparaît de dos à Moïse]",,"Réemploi de la gravure p.72",,,,,,,,"Pleine page",,"Gravure sur bois",PAT_16M_022_103_web,,,,,,,,,,,,,,,,,,,,,,,,,,,,,,,,,,,,"Agenouillé,Apparition,Bâton,Cacher,Dieu le Père,Intérieur,Livre de l'Exode,Maison,Moïse,Œil,Pain,Prosterné,Repas,Tente",https://hieronyma.ict-toulouse.fr/files/original/3742824c281b77a3ef8d91d56724baa8.jpg,"Image fixe","[Bible, latin, 1574]",1,0
"[Dieu s'adresse à Moïse. Les dix plaies d'Égypte : Pharaon convoque Moïse et Aaron après la dernière plaie]",,"Réemploi de la gravure p.72",,,,,,,,"Pleine page",,"Gravure sur bois",PAT_16M_022_078_web,,,,,,,,,,,,,,,,,,,,,,,,,,,,,,,,,,,,"Aaron,Agenouillé,Apparition,Bâton,Dieu le Père,Intérieur,La Pâque,Livre de l'Exode,Maison,Moïse,Nuée,Nuit,Pain,Pharaon,Repas,Torche",https://hieronyma.ict-toulouse.fr/files/original/de8eab0aba15b4a6a7810480a368606c.jpg,"Image fixe","[Bible, latin, 1574]",1,0
"[Dieu s'adresse à Samuel. Mort du grand-prêtre Éli]",,,,,,,,,,"Pleine page",,"Gravure sur bois",PAT_16M_022_150_web,,,,,,,,,,,,,,,,,,,,,,,,,,,,,,,,,,,,"Armée,Chute,Défaite,Dieu le Père,Éli,Extérieur,Intérieur,L'arche d'alliance,Messager,Mort,Nuit,Premier Livre de Samuel,Samuel,Temple,Voix",https://hieronyma.ict-toulouse.fr/files/original/f84a9fab31f1f9954bccfe617c1dd5d5.JPG,"Image fixe","[Bible, latin, 1574]",1,0
"[Frontispice :] Les Fleurs de la vie des Saincts...",,,,,,,,,,Planche,français,"Gravure sur cuivre",PAT_17G_193_001_web,,,,,,,,,,,,,,,,,,,,,,,,,,,,,,,,,,,,"Christ,Dieu le Père,Pape,Rayons lumineux,Saint,Saint Jean Baptiste,Saint Pierre,Saint-Esprit,Sainte,Tablette,Trinité,Vierge",https://hieronyma.ict-toulouse.fr/files/original/ec4715132dac1f787c5a2ecbe0e2f438.jpg,,"Les Fleurs des Vies des saints... [1678]",1,0
[L'Annonciation],,,,,,,,,,"Image pleine page",,"Gravure sur cuivre",RES_16M_502_033_web,,,,,,,,,,,,,,,,,,,,,,,,,,,,,,,,,,,,"Annonciation,Apparition,Archange,Chambre,Colombe,Dieu le Père,Intérieur,Lit,Livre,Lys,Nuée,Prière,Rayons lumineux,Saint Gabriel,Saint-Esprit,Vierge",https://hieronyma.ict-toulouse.fr/files/original/363e6044ae1ce16f1d4f57a2248405a0.jpg,,"Rosario della sacratiss. Virgine Maria",1,0
"[L'embarquement dans l'Arche]",,,,,,,,,,"Pleine page",,"Gravure sur bois",PAT_16M_022_006_web,,,,,,,,,,,,,,,,,,,,,,,,,,,,,,,,,,,,"Animal,Arche de Noé,Dieu le Père,Livre de la Genèse,Noé,Oiseau",https://hieronyma.ict-toulouse.fr/files/original/d44a9c1b341c7750e733fa1b5f87ca62.jpg,"Image fixe","[Bible, latin, 1574]",1,0
"[L'ouverture des sept sceaux. Les quatre cavaliers de l'Apocalypse]",,,,,,,,,,Vignettes,latin,"Gravure sur bois",PAT_16M_022_433_web,,,,,,,,,,,,,,,,,,,,,,,,,,,,,,,,,,,,"Allégorie,Ange,Arc,Balance,Cadavre,Cavalier,Damné,Dieu le Père,Épée,Famine,Flamme,Guerre de siège,La guerre,Lance,Lecture,Livre,Livre de l'Apocalypse,Mort,Soldat,Squelette,Vision",https://hieronyma.ict-toulouse.fr/files/original/b0a1d05b6b9a0c5827a6d76da1667515.jpg,,"[Bible, latin, 1574]",1,0
"[La création d'Ève. La tentation d'Adam et Ève]",,,,,,,,,,"Pleine page",,"Gravure sur bois",PAT_16M_022_002_web,,,,,,,,,,,,,,,,,,,,,,,,,,,,,,,,,,,,"Adam,Colloque « Paysage (s) » 2018,Créateur,Dieu le Père,Ève,L'arbre de vie,Le serpent d'Eden,Livre de la Genèse,Paradis terrestre,Sommeil,Tentation",https://hieronyma.ict-toulouse.fr/files/original/19fc472385c7e1b4cd4148d9d1e1bef4.jpg,"Image fixe","[Bible, latin, 1574]",1,0
"[La création du monde]",,,,,,,,,,"Pleine page",,"Gravure sur bois",PAT_16M_022_001_web,,,,,,,,,,,,,,,,,,,,,,,,,,,,,,,,,,,,"Angelot,Créateur,Dieu le Père,Jour,Lettre I,Livre de la Genèse,Mer,Nuit,Terre",https://hieronyma.ict-toulouse.fr/files/original/eea760d1da9c6ede3c3c9d6f68865ffd.jpg,"Image fixe","[Bible, latin, 1574]",1,1
"[La Femme vêtue de soleil. Les deux Bêtes de la terre et de la mer]",,,,,,,,,,Vignettes,latin,"Gravure sur bois",PAT_16M_022_438_web,,,,,,,,,,,,,,,,,,,,,,,,,,,,,,,,,,,,"Aigle,Aile,Archange,Combat,Dieu le Père,Dragon,Enfant,Étoile,Femme,Foule,Hybride,Livre de l'Apocalypse,Lune,Saint Michel,Satan,Soleil,Vision,Zoomorphe",https://hieronyma.ict-toulouse.fr/files/original/d52403bbb7a7cc631bcde6ce21fbbc8e.jpg,,"[Bible, latin, 1574]",1,0
