﻿"Dublin Core:Title","Dublin Core:Subject","Dublin Core:Description","Dublin Core:Creator","Dublin Core:Source","Dublin Core:Publisher","Dublin Core:Date","Dublin Core:Contributor","Dublin Core:Rights","Dublin Core:Relation","Dublin Core:Format","Dublin Core:Language","Dublin Core:Type","Dublin Core:Identifier","Dublin Core:Coverage","Item Type Metadata:Text","Item Type Metadata:Interviewer","Item Type Metadata:Interviewee","Item Type Metadata:Location","Item Type Metadata:Transcription","Item Type Metadata:Local URL","Item Type Metadata:Original Format","Item Type Metadata:Physical Dimensions","Item Type Metadata:Duration","Item Type Metadata:Compression","Item Type Metadata:Producer","Item Type Metadata:Director","Item Type Metadata:Bit Rate/Frequency","Item Type Metadata:Time Summary","Item Type Metadata:Email Body","Item Type Metadata:Subject Line","Item Type Metadata:From","Item Type Metadata:To","Item Type Metadata:CC","Item Type Metadata:BCC","Item Type Metadata:Number of Attachments","Item Type Metadata:Standards","Item Type Metadata:Objectives","Item Type Metadata:Materials","Item Type Metadata:Lesson Plan Text","Item Type Metadata:URL","Item Type Metadata:Event Type","Item Type Metadata:Participants","Item Type Metadata:Birth Date","Item Type Metadata:Birthplace","Item Type Metadata:Death Date","Item Type Metadata:Occupation","Item Type Metadata:Biographical Text","Item Type Metadata:Bibliography",tags,file,itemType,collection,public,featured
"[Frontispice : Allégorie de la médecine]",,,"Huebner, Bartholomaus (1727-1795)",,,,,,,"Image pleine page",,"Gravure sur cuivre",X_421_002_web,,,,,,,,,,,,,,,,,,,,,,,,,,,,,,,,,,,,"Allégorie,Apollon,Bâton,Coq,Couronne,Debout,Désigner,Femme,Laurier,Livre,Lyre,Médecine,Obélisque monumental,Putti,Serpent",https://hieronyma.ict-toulouse.fr/files/original/f4e771f2b3b9211c4aae073099522045.jpg,"Image fixe","Dictionnaire historique de la médecine",1,0
"[Jésus annonce la destruction du Temple]",,,,,,,,,,Vignette,latin,"Gravure sur bois",PAT_16M_022_324_web,,,,,,,,,,,,,,,,,,,,,,,,,,,,,,,,,,,,"Christ,Désigner,Évangile selon saint Matthieu,Le Temple,Les Apôtres",https://hieronyma.ict-toulouse.fr/files/original/8d51435a076bf98c3f5f2e6e4a58e687.jpg,,"[Bible, latin, 1574]",1,0
"[Jésus annonce la destruction du Temple]",,,,,,,,,,Vignette,latin,"Gravure sur bois",PAT_16M_022_347_web,,,,,,,,,,,,,,,,,,,,,,,,,,,,,,,,,,,,"Christ,Désigner,Évangile selon saint Marc,Le Temple,Les Apôtres",https://hieronyma.ict-toulouse.fr/files/original/1df0f9a8337f46ffc58c94de1ddb2f33.jpg,,"[Bible, latin, 1574]",1,0
"[L'ange montre à saint Jean la Jérusalem céleste]",,,,,,,,,,Vignette,latin,"Gravure sur bois",PAT_16M_022_444_web,,,,,,,,,,,,,,,,,,,,,,,,,,,,,,,,,,,,"Ange,Désigner,Instrument de mesure,Jérusalem céleste,Livre de l'Apocalypse,Porte,Saint Jean,Ville,Vision",https://hieronyma.ict-toulouse.fr/files/original/005a1e308736e4fb7b64c95dcd095065.jpg,,"[Bible, latin, 1574]",1,0
"[Le couronnement d'épines. Jésus présenté au peuple. La montée au Calvaire. La Crucifixion]",,,,,,,,,,Vignettes,latin,"Gravure sur bois",PAT_16M_022_404_web,,,,,,,,,,,,,,,,,,,,,,,,,,,,,,,,,,,,"Christ,Couronne d'épines,Couronnement d'épines,Crucifixion,Dérision du Christ,Désigner,Évangile selon saint Jean,Foule,Jésus présenté au peuple,La Croix,Le coup de lance,Les larrons,Les Saintes Femmes,Lune,Manteau,Montée au Calvaire,Nuit,Pâmoison de la Vierge,Passion,Présentation du vinaigre,Procès du Christ,Simon de Cyrène,Soldat,Soleil,Vierge",https://hieronyma.ict-toulouse.fr/files/original/534e4c1031042630e8dc936d92a18381.jpg,,"[Bible, latin, 1574]",1,0
"[Livre second : Jeanne d'Arc désigne le Christ]",,,,,,,,,,"Image pleine page",,"Gravure sur cuivre",PAT_17P_688_003_web,,,,,,,,,,,,,,,,,,,,,,,,,,,,,,,,,,,,"Angelot,Camp militaire,Charles VII (1403-1461, roi de France),Christ glorieux,Désigner,Jeanne d'Arc (1412-1431, sainte)",https://hieronyma.ict-toulouse.fr/files/original/3b457068f74bc9d1afc1c459690dbe15.jpg,,"La pucelle, : ou la France délivrée : poëme héroïque / par M. Chapelain",1,0
"[Livre septième : Roger décrit à deux prélats les différents tableaux retraçant la Guerre de Cent Ans]",,,,,,,,,,"Image pleine plage",,"Gravure sur cuivre",PAT_17P_688_011_web,,,,,,,,,,,,,,,,,,,,,,,,,,,,,,,,,,,,"Désigner,Intérieur,Prêtre,Tableau",https://hieronyma.ict-toulouse.fr/files/original/f731ec85802fe963330cbdd68365ef60.jpg,,"La pucelle, : ou la France délivrée : poëme héroïque / par M. Chapelain",1,0
"[Marque de l'imprimeur Robert Estienne]",,"Inscription dans le phylactère : ""Noli altum sapere""",,,,,,,,"Marque d'imprimeur",,"Gravure sur bois",RES_16G_020_016_web,,,,,,,,,,,,,,,,,,,,,,,,,,,,,,,,,,,,"Branche,Désigner,Homme,Olivier,Phylactère,Robert Estienne",https://hieronyma.ict-toulouse.fr/files/original/4748499954d84caf6bfd8f68ca9770f0.JPG,"Image fixe","[Bible, N.T., grec ancien, 1550]",1,1
"[Moïse présente les Tables de la Loi aux Hébreux. Les Hébreux font des offrandes pour le Tabernacle]",,,,,,,,,,"Pleine page",,"Gravure sur bois",PAT_16M_022_106_web,,,,,,,,,,,,,,,,,,,,,,,,,,,,,,,,,,,,"Désigner,Les Tables de la Loi,Livre de l'Exode,Mobilier biblique,Moïse,Offrande,Tente",https://hieronyma.ict-toulouse.fr/files/original/99af635e393b7badcdbb5927d325b846.jpg,"Image fixe","[Bible, latin, 1574]",1,0
"[Parabole des vignerons homicides. Jésus annonce la destruction du Temple]",,,,,,,,,,Vignettes,latin,"Gravure sur bois",PAT_16M_022_380_web,,,,,,,,,,,,,,,,,,,,,,,,,,,,,,,,,,,,"Désigner,Évangile selon saint Luc,Ferme,Le Temple,Les Apôtres,Les vignerons homicides,Meurtre,Parabole,Serviteur,Tour,Vigneron",https://hieronyma.ict-toulouse.fr/files/original/6688775485c129a6c241759969061016.jpg,,"[Bible, latin, 1574]",1,0
