﻿"Dublin Core:Title","Dublin Core:Subject","Dublin Core:Description","Dublin Core:Creator","Dublin Core:Source","Dublin Core:Publisher","Dublin Core:Date","Dublin Core:Contributor","Dublin Core:Rights","Dublin Core:Relation","Dublin Core:Format","Dublin Core:Language","Dublin Core:Type","Dublin Core:Identifier","Dublin Core:Coverage","Item Type Metadata:Text","Item Type Metadata:Interviewer","Item Type Metadata:Interviewee","Item Type Metadata:Location","Item Type Metadata:Transcription","Item Type Metadata:Local URL","Item Type Metadata:Original Format","Item Type Metadata:Physical Dimensions","Item Type Metadata:Duration","Item Type Metadata:Compression","Item Type Metadata:Producer","Item Type Metadata:Director","Item Type Metadata:Bit Rate/Frequency","Item Type Metadata:Time Summary","Item Type Metadata:Email Body","Item Type Metadata:Subject Line","Item Type Metadata:From","Item Type Metadata:To","Item Type Metadata:CC","Item Type Metadata:BCC","Item Type Metadata:Number of Attachments","Item Type Metadata:Standards","Item Type Metadata:Objectives","Item Type Metadata:Materials","Item Type Metadata:Lesson Plan Text","Item Type Metadata:URL","Item Type Metadata:Event Type","Item Type Metadata:Participants","Item Type Metadata:Birth Date","Item Type Metadata:Birthplace","Item Type Metadata:Death Date","Item Type Metadata:Occupation","Item Type Metadata:Biographical Text","Item Type Metadata:Bibliography",tags,file,itemType,collection,public,featured
"[Le Couronnement de la Vierge]",,,,,,,,,,"Image pleine page",,"Gravure sur cuivre",RES_16M_502_074_web,,,,,,,,,,,,,,,,,,,,,,,,,,,,,,,,,,,,"Christ,Colombe,Couronne,Couronnement de la Vierge,Dieu le Père,Martyr,Nuée,Palme,Rayons lumineux,Saint,Saint-Esprit,Sainte,Trinité,Vierge",https://hieronyma.ict-toulouse.fr/files/original/cac21a819e897132b31f765e24617560.jpg,,"Rosario della sacratiss. Virgine Maria",1,0
"[La Pentecôte]",,,,,,,,,,"Image pleine page",,"Gravure sur cuivre",RES_16M_502_068_web,,,,,,,,,,,,,,,,,,,,,,,,,,,,,,,,,,,,"Colombe,Flamme,Lecture,Les Apôtres,Livre,Pentecôte,Prière,Rayons lumineux,Saint-Esprit,Vierge",https://hieronyma.ict-toulouse.fr/files/original/68a75ecebd717976827b684077da39fd.jpg,,"Rosario della sacratiss. Virgine Maria",1,0
[L'Annonciation],,,,,,,,,,"Image pleine page",,"Gravure sur cuivre",RES_16M_502_033_web,,,,,,,,,,,,,,,,,,,,,,,,,,,,,,,,,,,,"Annonciation,Apparition,Archange,Chambre,Colombe,Dieu le Père,Intérieur,Lit,Livre,Lys,Nuée,Prière,Rayons lumineux,Saint Gabriel,Saint-Esprit,Vierge",https://hieronyma.ict-toulouse.fr/files/original/363e6044ae1ce16f1d4f57a2248405a0.jpg,,"Rosario della sacratiss. Virgine Maria",1,0
"[Page de titre avec la marque de l'imprimeur ]",,,"Picart, Bernard, 1673-1733, Illustrateur",,,,,,,"Pleine page ; Vignette",français,"Gravure sur cuivre",PAT_18G_002_000_web,,,,,,,,,,,,,,,,,,,,,,,,,,,,,,,,,,,,"Colombe,Cupidon,Cygne,Élément végétal,Vénus",https://hieronyma.ict-toulouse.fr/files/original/661b5112a0c13bcf9d87913284f99af5.jpg,,"Ceremonies et coutumes religieuses de tous les peuples du monde..., 2",1,0
"Les festes du mois de mars : l'Ange gardien, St Joseph, St Cyrille, S. Gregoire, [l'Annonciation], S. Benoist, S. Gertrude, St Thomas, S. Jean [Climaque]",,,,,,,,,,"Image pleine page",français,"Gravure sur cuivre",PAT_17G_193_007_web,,,,,,,,,,,,,,,,,,,,,,,,,,,,,,,,,,,,"Abbesse,Ange,Annonciation,Auréole,Chambre,Chape,Colombe,Crâne,Crosse,Crucifix,Dominicain,Écriture,Enfant Jésus,Évêque,Livre,Lys,Mitre,Pain,Pape,Prière,Rayons lumineux,Religieux,Saint Benoît de Nursie,Saint Cyrille de Jérusalem,Saint Gabriel,Saint Grégoire le Grand,Saint Jean Climaque,Saint Joseph,Saint Thomas d'Aquin,Saint-Esprit,Sainte Gertrude de Nivelles,Tiare,Vierge",https://hieronyma.ict-toulouse.fr/files/original/17cee503f35e07239fbed36a0cf24caa.jpg,,"Les Fleurs des Vies des saints... [1678]",1,0
"La descente du St Esprit sur les Disciples",,,,,,,,,,"Image mi-page","français ; latin","Gravure sur cuivre",PAT_18G_001_226b,,,,,,,,,,,,,,,,,,,,,,,,,,,,,,,,,,,,"Actes des Apôtres,Colombe,Flamme,Intérieur,Les Apôtres,Livre,Pentecôte,Saint-Esprit,Vierge",https://hieronyma.ict-toulouse.fr/files/original/1e65127d354ab7bdbdbe994070611694.JPG,,"L'Ancien et le Nouveau Testament représentés en cinq cens tableaux gravés d'après les desseins de Raphaël & autres grands maîtres et expliqués par les paroles de l'Ecriture",1,0
"Jesus chasse les vendeurs du temple",,,,,,,,,,"Image mi-page","français ; latin","Gravure sur cuivre",PAT_18G_001_178b,,,,,,,,,,,,,,,,,,,,,,,,,,,,,,,,,,,,"Animal,Boeuf,Christ,Colombe,Commerçant,Commerce,Évangile selon saint Jean,Expulsion,Expulsion des marchands du Temple,Fouet,Le Temple,Monnaie,Offrande religieuse,Richesse",https://hieronyma.ict-toulouse.fr/files/original/190414f2def5f0bf8d0385f7ea7238ec.JPG,,"L'Ancien et le Nouveau Testament représentés en cinq cens tableaux gravés d'après les desseins de Raphaël & autres grands maîtres et expliqués par les paroles de l'Ecriture",1,0
"[Le baptême du Christ. La tentation du Christ]",,,,,,,,,,Vignettes,latin,"Gravure sur bois",PAT_16M_022_359_web,,,,,,,,,,,,,,,,,,,,,,,,,,,,,,,,,,,,"Baptême du Christ,Christ,Colombe,Désert,Dieu le Père,Évangile selon saint Luc,Jourdain,Le Temple,Pierre,Saint Jean Baptiste,Saint-Esprit,Satan,Tentation du Christ",https://hieronyma.ict-toulouse.fr/files/original/56f7df78d30433c1178ed1330e5f80f6.jpg,,"[Bible, latin, 1574]",1,0
"[Scènes de l'enfance du Christ]",,,,,,,,,,Vignettes,latin,"Gravure sur bois",PAT_16M_022_357_web,,,,,,,,,,,,,,,,,,,,,,,,,,,,,,,,,,,,"Ange,Annonce aux bergers,Apparition,Berger,Chien,Christ,Circoncision,Colombe,Enfance du Christ,Enfant Jésus,Évangile selon saint Luc,Le Temple,Phylactère,Présentation au Temple,Prêtre,Sacrifice,Saint Joseph,Syméon,Vierge",https://hieronyma.ict-toulouse.fr/files/original/bf35473baba9667bcd3b1c40b8170821.jpg,,"[Bible, latin, 1574]",1,0
"[Massacre des Innocents. Saint Jean Baptiste prêchant dans le désert. Baptême du Christ]",,,,,,,,,,Vignettes,latin,"Gravure sur bois",PAT_16M_022_302_web,,,,,,,,,,,,,,,,,,,,,,,,,,,,,,,,,,,,"Amour maternel,Baptême du Christ,Cadavre,Colombe,Désert,Dieu le Père,Enfance du Christ,Évangile selon saint Matthieu,Fleuve,Groupe,Jourdain,Massacre des Innocents,Meurtre,Mort par le fer,Nourrisson,Prédication,Rayons lumineux,Saint Jean Baptiste,Saint-Esprit,Soldat",https://hieronyma.ict-toulouse.fr/files/original/f19161e26e555a0af53323b8def1341b.jpg,,"[Bible, latin, 1574]",1,0
