﻿"Dublin Core:Title","Dublin Core:Subject","Dublin Core:Description","Dublin Core:Creator","Dublin Core:Source","Dublin Core:Publisher","Dublin Core:Date","Dublin Core:Contributor","Dublin Core:Rights","Dublin Core:Relation","Dublin Core:Format","Dublin Core:Language","Dublin Core:Type","Dublin Core:Identifier","Dublin Core:Coverage","Item Type Metadata:Text","Item Type Metadata:Interviewer","Item Type Metadata:Interviewee","Item Type Metadata:Location","Item Type Metadata:Transcription","Item Type Metadata:Local URL","Item Type Metadata:Original Format","Item Type Metadata:Physical Dimensions","Item Type Metadata:Duration","Item Type Metadata:Compression","Item Type Metadata:Producer","Item Type Metadata:Director","Item Type Metadata:Bit Rate/Frequency","Item Type Metadata:Time Summary","Item Type Metadata:Email Body","Item Type Metadata:Subject Line","Item Type Metadata:From","Item Type Metadata:To","Item Type Metadata:CC","Item Type Metadata:BCC","Item Type Metadata:Number of Attachments","Item Type Metadata:Standards","Item Type Metadata:Objectives","Item Type Metadata:Materials","Item Type Metadata:Lesson Plan Text","Item Type Metadata:URL","Item Type Metadata:Event Type","Item Type Metadata:Participants","Item Type Metadata:Birth Date","Item Type Metadata:Birthplace","Item Type Metadata:Death Date","Item Type Metadata:Occupation","Item Type Metadata:Biographical Text","Item Type Metadata:Bibliography",tags,file,itemType,collection,public,featured
"Sermon sur la montagne",,,,,,,,,,Planche,,"Gravure sur acier",1133_SAI_2_050_web,,,,,,,,,,,,,,,,,,,,,,,,,,,,,,,,,,,,"Christ,Christ enseignant,Évangile selon saint Matthieu,Foule,Le sermon sur la montagne,Montagne,Prédication",https://hieronyma.ict-toulouse.fr/files/original/ee7b5769bffd49572ad4cf72beb13dde.JPG,,"La Sainte Bible : traduction nouvelle selon la Vulgate",1,0
"Obstacle des Richesses a la perfection evangelique",,,,,,,,,,"Image mi-page","français ; latin","Gravure sur cuivre",PAT_18G_001_193b,,,,,,,,,,,,,,,,,,,,,,,,,,,,,,,,,,,,"Christ enseignant,Évangile selon saint Matthieu,Foule,Jeune homme,Richesse,Tristesse",https://hieronyma.ict-toulouse.fr/files/original/08fb2d6face6cbdfc7c8e00ba9b65eac.JPG,,"L'Ancien et le Nouveau Testament représentés en cinq cens tableaux gravés d'après les desseins de Raphaël & autres grands maîtres et expliqués par les paroles de l'Ecriture",1,0
"Nicodeme va de nuit trouver J.C.",,,,,,,,,,"Image mi-page","français ; latin","Gravure sur cuivre",PAT_18G_001_179a,,,,,,,,,,,,,,,,,,,,,,,,,,,,,,,,,,,,"Chandelle,Christ,Christ enseignant,Discussion,Évangile selon saint Jean,Intérieur,Nicodème,Nuit",https://hieronyma.ict-toulouse.fr/files/original/d73fead32369fbf0acf5b28aa83bb669.JPG,,"L'Ancien et le Nouveau Testament représentés en cinq cens tableaux gravés d'après les desseins de Raphaël & autres grands maîtres et expliqués par les paroles de l'Ecriture",1,0
"Les Apôtres cueillant des épis le jour du sabbat",,,,,,,,,,Planche,,"Gravure sur acier",1133_SAI_2_055_web,,,,,,,,,,,,,,,,,,,,,,,,,,,,,,,,,,,,"Accusation,Blé,Champ,Christ,Christ enseignant,Évangile selon saint Matthieu,Les Apôtres,Les épis arrachés le jour du Sabbat,Moisson",https://hieronyma.ict-toulouse.fr/files/original/2d76d2987f9473a4e6e1a61179b377ee.JPG,,"La Sainte Bible : traduction nouvelle selon la Vulgate",1,0
"Le pharisien et le publicain.",,,,,,,,,,Planche,,"Gravure sur acier",1133_SAI_2_067_web,,,,,,,,,,,,,,,,,,,,,,,,,,,,,,,,,,,,"Agenouillé,Christ,Christ enseignant,Debout,Évangile selon saint Luc,Intérieur,Le Temple,Les Apôtres,Parabole,Prière",https://hieronyma.ict-toulouse.fr/files/original/7e0c72b054e7914da7987bc2b7512a94.JPG,,"La Sainte Bible : traduction nouvelle selon la Vulgate",1,0
"Le denier de la veuve.",,,,,,,,,,Planche,,"Gravure sur acier",1133_SAI_2_073_web,,,,,,,,,,,,,,,,,,,,,,,,,,,,,,,,,,,,"Christ,Christ enseignant,Évangile selon saint Marc,Femme,Le Temple,Les Apôtres,Monnaie,Offrande",https://hieronyma.ict-toulouse.fr/files/original/35bed450bed4f9edc1be6bd5e4a0c2cd.JPG,,"La Sainte Bible : traduction nouvelle selon la Vulgate",1,0
"Le denier de César.",,,,,,,,,,Planche,,"Gravure sur acier",1133_SAI_2_072_web,,,,,,,,,,,,,,,,,,,,,,,,,,,,,,,,,,,,"Christ,Christ enseignant,Évangile selon saint Matthieu,Le denier de César,Monnaie",https://hieronyma.ict-toulouse.fr/files/original/62f7703a4309694dcc1b1273e083398d.JPG,,"La Sainte Bible : traduction nouvelle selon la Vulgate",1,0
"La veuve qui donne l'aumone de son necessaire",,,,,,,,,,"Image mi-page","français ; latin","Gravure sur cuivre",PAT_18G_001_208a,,,,,,,,,,,,,,,,,,,,,,,,,,,,,,,,,,,,"Christ enseignant,Évangile selon saint Luc,Femme,Le Temple,Monnaie,Offrande",https://hieronyma.ict-toulouse.fr/files/original/43fe9d289af14d552f992e70a16c5276.JPG,,"L'Ancien et le Nouveau Testament représentés en cinq cens tableaux gravés d'après les desseins de Raphaël & autres grands maîtres et expliqués par les paroles de l'Ecriture",1,0
"Jésus prêchant sur la mer de Galilée.",,,,,,,,,,Planche,,"Gravure sur acier",1133_SAI_2_046_web,,,,,,,,,,,,,,,,,,,,,,,,,,,,,,,,,,,,"Barque,Christ,Christ enseignant,Évangile selon saint Luc,Lac de Tibériade,Prédication",https://hieronyma.ict-toulouse.fr/files/original/b131faf9300ab4a04cb554a9ad0f22dc.JPG,,"La Sainte Bible : traduction nouvelle selon la Vulgate",1,0
"Jésus prêchant la multitude",,,,,,,,,,Planche,,"Gravure sur acier",1133_SAI_2_048_web,,,,,,,,,,,,,,,,,,,,,,,,,,,,,,,,,,,,"Arbre,Christ,Christ enseignant,Évangile selon saint Matthieu,Foule,Prédication",https://hieronyma.ict-toulouse.fr/files/original/36992e00d7b95154c1c458c7c612cebe.JPG,,"La Sainte Bible : traduction nouvelle selon la Vulgate",1,0
