﻿"Dublin Core:Title","Dublin Core:Subject","Dublin Core:Description","Dublin Core:Creator","Dublin Core:Source","Dublin Core:Publisher","Dublin Core:Date","Dublin Core:Contributor","Dublin Core:Rights","Dublin Core:Relation","Dublin Core:Format","Dublin Core:Language","Dublin Core:Type","Dublin Core:Identifier","Dublin Core:Coverage","Item Type Metadata:Text","Item Type Metadata:Interviewer","Item Type Metadata:Interviewee","Item Type Metadata:Location","Item Type Metadata:Transcription","Item Type Metadata:Local URL","Item Type Metadata:Original Format","Item Type Metadata:Physical Dimensions","Item Type Metadata:Duration","Item Type Metadata:Compression","Item Type Metadata:Producer","Item Type Metadata:Director","Item Type Metadata:Bit Rate/Frequency","Item Type Metadata:Time Summary","Item Type Metadata:Email Body","Item Type Metadata:Subject Line","Item Type Metadata:From","Item Type Metadata:To","Item Type Metadata:CC","Item Type Metadata:BCC","Item Type Metadata:Number of Attachments","Item Type Metadata:Standards","Item Type Metadata:Objectives","Item Type Metadata:Materials","Item Type Metadata:Lesson Plan Text","Item Type Metadata:URL","Item Type Metadata:Event Type","Item Type Metadata:Participants","Item Type Metadata:Birth Date","Item Type Metadata:Birthplace","Item Type Metadata:Death Date","Item Type Metadata:Occupation","Item Type Metadata:Biographical Text","Item Type Metadata:Bibliography",tags,file,itemType,collection,public,featured
"[De l’arrivée de Clavilègne, avec la fin de cette longue aventure.]",,,,,,,,,,Vignette,,"Gravure sur bois",S_1826_032_web,,,,,,,,,,,,,,,,,,,,,,,,,,,,,,,,,,,,"Cheval,Don Quichotte,Lance,Soldat",https://hieronyma.ict-toulouse.fr/files/original/eef0ef5d843e5f9d54c77a13950b6594.jpg,"Image fixe","Don Quichotte",1,0
"[De ce qui arriva à Don Quichotte allant à Barcelone]",,,,,,,,,,Vignette,,"Gravure sur bois",S_1826_033_web,,,,,,,,,,,,,,,,,,,,,,,,,,,,,,,,,,,,"Cheval,Combat,Don Quichotte,Soldat",https://hieronyma.ict-toulouse.fr/files/original/b6fbf745cfa6c369f3e85756a65ecccf.jpg,"Image fixe","Don Quichotte",1,0
"[L’aventure qui donna le plus de chagrin à Don Quichotte]",,,,,,,,,,Vignette,,"Gravure sur bois",S_1826_034_web,,,,,,,,,,,,,,,,,,,,,,,,,,,,,,,,,,,,"Cheval,Combat,Don Quichotte,Échec,Soldat",https://hieronyma.ict-toulouse.fr/files/original/5235e4e2a18b1870f138e6885cb9ef8d.jpg,"Image fixe","Don Quichotte",1,0
"[Une joyeuse aventure]",,,,,,,,,,Vignette,,"Gravure sur bois",S_1826_035_web,,,,,,,,,,,,,,,,,,,,,,,,,,,,,,,,,,,,"Chasse,Cheval,Don Quichotte,Soldat",https://hieronyma.ict-toulouse.fr/files/original/af23612d18dc1fc751bb87207490ad1e.jpg,"Image fixe","Don Quichotte",1,0
"[Abner tue Asahel]",,,,,,,,,,"Pleine page",,"Gravure sur bois",PAT_16M_022_171_web,,,,,,,,,,,,,,,,,,,,,,,,,,,,,,,,,,,,"Abner,Asahel,Cavalier,Cheval,Deuxième livre de Samuel,Fuite,Lance,Mort par coup,Poursuite militaire",https://hieronyma.ict-toulouse.fr/files/original/9d2ef4b36d41e25be28d8238bac47732.jpg,"Image fixe","[Bible, latin, 1574]",1,0
"Vision de Zacharie.",,,,,,,,,,Planche,,"Gravure sur acier",1133_SAI_2_021_web,,,,,,,,,,,,,,,,,,,,,,,,,,,,,,,,,,,,"Ange,Char,Cheval,Livre de Zacharie,Montagne,Vent,Vision",https://hieronyma.ict-toulouse.fr/files/original/2ab79e34a81acab6c0f6702be160777a.JPG,,"La Sainte Bible : traduction nouvelle selon la Vulgate",1,0
"Le bon Samaritain",,,,,,,,,,Planche,,"Gravure sur acier",1133_SAI_2_060_web,,,,,,,,,,,,,,,,,,,,,,,,,,,,,,,,,,,,"Blessé,Cheval,Évangile selon saint Luc,Le bon Samaritain,Parabole,Secours,Voyageur",https://hieronyma.ict-toulouse.fr/files/original/e34148f6fb7378d3ef0e361498553f1d.JPG,,"La Sainte Bible : traduction nouvelle selon la Vulgate",1,0
"Arrivée du bon Samaritain à l'hôtellerie",,,,,,,,,,Planche,,"Gravure sur acier",1133_SAI_2_061_web,,,,,,,,,,,,,,,,,,,,,,,,,,,,,,,,,,,,"Auberge,Blessé,Cheval,Évangile selon saint Luc,Le bon Samaritain,Parabole,Secours,Voyageur",https://hieronyma.ict-toulouse.fr/files/original/3118575ef427517c045b3ae04d0b8fec.JPG,,"La Sainte Bible : traduction nouvelle selon la Vulgate",1,0
"La mort (vision de saint Jean).",,,,,,,,,,Planche,,"Gravure sur acier",1133_SAI_2_107_web,,,,,,,,,,,,,,,,,,,,,,,,,,,,,,,,,,,,"Allégorie,Apocalypse,Cavalier,Cheval,Diable,Faux,Mort,Vision",https://hieronyma.ict-toulouse.fr/files/original/aead560831f0641a575cccaaec7d8c67.JPG,,"La Sainte Bible : traduction nouvelle selon la Vulgate",1,0
"[Le bon Samaritain]",,,,,,,,,,Vignette,latin,"Gravure sur bois",PAT_16M_022_370_web,,,,,,,,,,,,,,,,,,,,,,,,,,,,,,,,,,,,"Blessé,Cheval,Évangile selon saint Luc,Le bon Samaritain,Parabole,Prêtre,Secours,Voyageur",https://hieronyma.ict-toulouse.fr/files/original/4f187090b158c74a6c340f694be291a6.jpg,,"[Bible, latin, 1574]",1,0
