﻿"Dublin Core:Title","Dublin Core:Subject","Dublin Core:Description","Dublin Core:Creator","Dublin Core:Source","Dublin Core:Publisher","Dublin Core:Date","Dublin Core:Contributor","Dublin Core:Rights","Dublin Core:Relation","Dublin Core:Format","Dublin Core:Language","Dublin Core:Type","Dublin Core:Identifier","Dublin Core:Coverage","Item Type Metadata:Text","Item Type Metadata:Interviewer","Item Type Metadata:Interviewee","Item Type Metadata:Location","Item Type Metadata:Transcription","Item Type Metadata:Local URL","Item Type Metadata:Original Format","Item Type Metadata:Physical Dimensions","Item Type Metadata:Duration","Item Type Metadata:Compression","Item Type Metadata:Producer","Item Type Metadata:Director","Item Type Metadata:Bit Rate/Frequency","Item Type Metadata:Time Summary","Item Type Metadata:Email Body","Item Type Metadata:Subject Line","Item Type Metadata:From","Item Type Metadata:To","Item Type Metadata:CC","Item Type Metadata:BCC","Item Type Metadata:Number of Attachments","Item Type Metadata:Standards","Item Type Metadata:Objectives","Item Type Metadata:Materials","Item Type Metadata:Lesson Plan Text","Item Type Metadata:URL","Item Type Metadata:Event Type","Item Type Metadata:Participants","Item Type Metadata:Birth Date","Item Type Metadata:Birthplace","Item Type Metadata:Death Date","Item Type Metadata:Occupation","Item Type Metadata:Biographical Text","Item Type Metadata:Bibliography",tags,file,itemType,collection,public,featured
"Liv. 20 : Telemaque après avoir donné la vie à Adraste, est obligé de le tuer pour sauver la sienne.",,,,,,,,,,Planche,français,"Gravure sur cuivre",FD_487-2_008_web,,,,,,,,,,,,,,,,,,,,,,,,,,,,,,,,,,,,"Cavalier,Combat singulier,Mort par le fer,Rempart,Soldat,Télémaque,Ville",https://hieronyma.ict-toulouse.fr/files/original/1ca3dd5f30a1c8a8cbc0f3cec5349e73.jpg,,"Les aventures de Télémaque, fils d'Ulysse",1,0
"La mort (vision de saint Jean).",,,,,,,,,,Planche,,"Gravure sur acier",1133_SAI_2_107_web,,,,,,,,,,,,,,,,,,,,,,,,,,,,,,,,,,,,"Allégorie,Apocalypse,Cavalier,Cheval,Diable,Faux,Mort,Vision",https://hieronyma.ict-toulouse.fr/files/original/aead560831f0641a575cccaaec7d8c67.JPG,,"La Sainte Bible : traduction nouvelle selon la Vulgate",1,0
"Saint Paul sur le chemin de Damas.",,,,,,,,,,Planche,,"Gravure sur acier",1133_SAI_2_099_web,,,,,,,,,,,,,,,,,,,,,,,,,,,,,,,,,,,,"Actes des Apôtres,Cavalier,Chemin,Conversion,Rayons lumineux,Saint Paul de Tarse,Soldat",https://hieronyma.ict-toulouse.fr/files/original/8f1e01cf2f1f17c557308ce4c54d33d8.JPG,,"La Sainte Bible : traduction nouvelle selon la Vulgate",1,0
"Judas Machabée en présence de l'armée de Nicanor.",,,,,,,,,,Planche,,"Gravure sur acier",1133_SAI_2_032_web,,,,,,,,,,,,,,,,,,,,,,,,,,,,,,,,,,,,"Armée,Cavalier,Deuxième Livre des Maccabées,Éléphant,Épée,Judas Maccabée",https://hieronyma.ict-toulouse.fr/files/original/157a092bf2e38f7afe7c1d34749f13f4.JPG,,"La Sainte Bible : traduction nouvelle selon la Vulgate",1,0
"L'ange des Machabées.",,,,,,,,,,Planche,,"Gravure sur acier",1133_SAI_2_030_web,,,,,,,,,,,,,,,,,,,,,,,,,,,,,,,,,,,,"Ange,Apparition,Armée,Cavalier,Deuxième Livre des Maccabées,Étendard",https://hieronyma.ict-toulouse.fr/files/original/4b72e7bffcab4b2ff576a7c6b308d35d.JPG,,"La Sainte Bible : traduction nouvelle selon la Vulgate",1,0
"Chute d'Antiochus.",,,,,,,,,,Planche,,"Gravure sur acier",1133_SAI_2_029_web,,,,,,,,,,,,,,,,,,,,,,,,,,,,,,,,,,,,"Antiochos IV,Armée,Cavalier,Char,Chute,Deuxième Livre des Maccabées,Éléphant,Mort",https://hieronyma.ict-toulouse.fr/files/original/a7734e17365b38ee4958b7dbcbc8be28.JPG,,"La Sainte Bible : traduction nouvelle selon la Vulgate",1,0
"Judas Machabée poursuit Timothée.",,,,,,,,,,Planche,,"Gravure sur acier",1133_SAI_2_028_web,,,,,,,,,,,,,,,,,,,,,,,,,,,,,,,,,,,,"Cavalier,Judas Maccabée,Poursuite militaire,Premier Livre des Maccabées,Torrent",https://hieronyma.ict-toulouse.fr/files/original/eb702f86d72bbdf62f433dc109d69f50.JPG,,"La Sainte Bible : traduction nouvelle selon la Vulgate",1,0
"Héliodore chassé du Temple.",,,,,,,,,,Planche,,"Gravure sur acier",1133_SAI_2_022_web,,,,,,,,,,,,,,,,,,,,,,,,,,,,,,,,,,,,"Ange,Apparition,Cavalier,Deuxième Livre des Maccabées,Fouet,Héliodore,Intérieur,Le Temple,Pégase,Punition",https://hieronyma.ict-toulouse.fr/files/original/19d17904487012522c544b746ad38dee.JPG,,"La Sainte Bible : traduction nouvelle selon la Vulgate",1,0
"[Le Paradis]",,,,,,,,,,"Image pleine page",,"Gravure sur cuivre",PAT_17P_618_022_web,,,,,,,,,,,,,,,,,,,,,,,,,,,,,,,,,,,,"Ange,Assis,Bateau à voiles,Calice,Cavalier,Christ,Cortège,Dauphin,David,Dieu le Père,Goliath,Jourdain,L'arche d'alliance,Naufrage,Nuée,Pierre,Prière,Rayons lumineux,Roi,Saint,Saint-Esprit,Salomon,Siège roulant,Tête,Trinité,Triomphe,Trône",https://hieronyma.ict-toulouse.fr/files/original/b1b9ccc81f82fe970341abe23ba854b5.jpg,"Image fixe","Catechisme Royal",1,0
"Henriade, Chant X",,,,,,,,,,Planche,,"Gravure sur cuivre",PAT_18P_179_019_web,,,,,,,,,,,,,,,,,,,,,,,,,,,,,,,,,,,,"Allégorie,Cavalier,Henri IV (1553-1610, roi de France),JEP2019,L'Église,Soleil,Vérité",https://hieronyma.ict-toulouse.fr/files/original/069f906bb1061bdd674eca235fda1a48.jpg,"Image fixe","La Henriade. 1787",1,0
