﻿"Dublin Core:Title","Dublin Core:Subject","Dublin Core:Description","Dublin Core:Creator","Dublin Core:Source","Dublin Core:Publisher","Dublin Core:Date","Dublin Core:Contributor","Dublin Core:Rights","Dublin Core:Relation","Dublin Core:Format","Dublin Core:Language","Dublin Core:Type","Dublin Core:Identifier","Dublin Core:Coverage","Item Type Metadata:Text","Item Type Metadata:Interviewer","Item Type Metadata:Interviewee","Item Type Metadata:Location","Item Type Metadata:Transcription","Item Type Metadata:Local URL","Item Type Metadata:Original Format","Item Type Metadata:Physical Dimensions","Item Type Metadata:Duration","Item Type Metadata:Compression","Item Type Metadata:Producer","Item Type Metadata:Director","Item Type Metadata:Bit Rate/Frequency","Item Type Metadata:Time Summary","Item Type Metadata:Email Body","Item Type Metadata:Subject Line","Item Type Metadata:From","Item Type Metadata:To","Item Type Metadata:CC","Item Type Metadata:BCC","Item Type Metadata:Number of Attachments","Item Type Metadata:Standards","Item Type Metadata:Objectives","Item Type Metadata:Materials","Item Type Metadata:Lesson Plan Text","Item Type Metadata:URL","Item Type Metadata:Event Type","Item Type Metadata:Participants","Item Type Metadata:Birth Date","Item Type Metadata:Birthplace","Item Type Metadata:Death Date","Item Type Metadata:Occupation","Item Type Metadata:Biographical Text","Item Type Metadata:Bibliography",tags,file,itemType,collection,public,featured
"N°14 : Aquapolque",,,,,,,,,,Planche,,"Gravure sur cuivre",RES_17P_003_026_web,,,,,,,,,,,,,,,,,,,,,,,,,,,,,,,,,,,,"Acapulco,Animal,Barque,Bateau à voiles,Canon,Captif,Chargement,Commerce,Église,Espagnol,Fortification,Hollandais,Marine,Mexique,Océan Pacifique,Poisson,Port,Trêve",https://hieronyma.ict-toulouse.fr/files/original/6b0d66373ffd99279412102d5a720537.jpg,"Image fixe","Speculum orientalis occidentalisque Indiae navigationum [...]",1,0
"[Capture de Lot. Gravure illustrant le chapitre 14 de la Genèse]",,,,,,,,,,"Pleine page",,"Gravure sur bois",PAT_16M_022_013_web,,,,,,,,,,,,,,,,,,,,,,,,,,,,,,,,,,,,"Armée,Captif,Livre de la Genèse,Lot,Soldat",https://hieronyma.ict-toulouse.fr/files/original/325d5622cce4134e1b48f0c7325b4032.jpg,"Image fixe","[Bible, latin, 1574]",1,0
"[Début du Livre des Juges : Victoire des Hébreux sur les Cananéens]",,,,,,,,,,"Pleine page",,"Gravure sur bois",PAT_16M_022_130_web,,,,,,,,,,,,,,,,,,,,,,,,,,,,,,,,,,,,"Armée,Captif,Défaite,Livre des Juges,Roi,Tente,Victoire",https://hieronyma.ict-toulouse.fr/files/original/73be20554976aaf51e5c8ff514178ccb.jpg,"Image fixe","[Bible, latin, 1574]",1,0
"[Le roi Sédécias est conduit devant Nabuchodonosor pour être aveuglé et enchaîné]",,,,,,,,,,Vignette,,"Gravure sur bois",PAT_16M_022_224_web,,,,,,,,,,,,,,,,,,,,,,,,,,,,,,,,,,,,"Captif,Châtiment judiciaire,Deuxième Livre des Rois,Jugement,Nabuchodonosor II,Roi,Sceptre,Sédécias,Soldat,Trône",https://hieronyma.ict-toulouse.fr/files/original/41b6405d730be0c728c20a2920a7229a.jpg,"Image fixe","[Bible, latin, 1574]",1,0
"[Daniel dans la fosse aux lions]",,,,,,,,,,Vignette,,"Gravure sur bois",PAT_16M_022_271_web,,,,,,,,,,,,,,,,,,,,,,,,,,,,,,,,,,,,"Ange,Captif,Daniel,Grand prophète,Grotte,Habacuc,Lion,Lionne,Livre de Daniel,Nourriture,Petit Prophète",https://hieronyma.ict-toulouse.fr/files/original/b33bc6ac2453f3f731249e27dfee6f73.jpg,"Image fixe","[Bible, latin, 1574]",1,0
"Daniel dans la fosse aux lions.",,,,,,,,,,Planche,,"Gravure sur acier",1133_SAI_2_012_web,,,,,,,,,,,,,,,,,,,,,,,,,,,,,,,,,,,,"Captif,Daniel,Grand prophète,Grotte,Lion,Livre de Daniel,Os d'animal",https://hieronyma.ict-toulouse.fr/files/original/77f7be9b808c85c47ec9159307ea50a5.JPG,,"La Sainte Bible : traduction nouvelle selon la Vulgate",1,0
"[Triomphe] du Roy David apres sa victoire sur les syriens",,,,,,,,,,"Image mi-page","français ; latin","Gravure sur cuivre",PAT_18G_001_113_web_b,,,,,,,,,,,,,,,,,,,,,,,,,,,,,,,,,,,,"Armure,Captif,Char de guerre,David,Deuxième livre de Samuel,Harpe,Roi,Soldat,Tête,Triomphe",https://hieronyma.ict-toulouse.fr/files/original/ad1ef50e9d3026cbcb84ad21daef228c.JPG,,"L'Ancien et le Nouveau Testament représentés en cinq cens tableaux gravés d'après les desseins de Raphaël & autres grands maîtres et expliqués par les paroles de l'Ecriture",1,0
"Daniel dans la fosse aux lions.",,,,,,,,,,"Image mi-page","français ; latin","Gravure sur cuivre",PAT_18G_001_147a,,,,,,,,,,,,,,,,,,,,,,,,,,,,,,,,,,,,"Captif,Daniel,Grand prophète,Lion,Livre de Daniel,Miracle,Prison,Roi",https://hieronyma.ict-toulouse.fr/files/original/6785af6721494a7734e78ce3af8f635e.JPG,,"L'Ancien et le Nouveau Testament représentés en cinq cens tableaux gravés d'après les desseins de Raphaël & autres grands maîtres et expliqués par les paroles de l'Ecriture",1,0
