﻿"Dublin Core:Title","Dublin Core:Subject","Dublin Core:Description","Dublin Core:Creator","Dublin Core:Source","Dublin Core:Publisher","Dublin Core:Date","Dublin Core:Contributor","Dublin Core:Rights","Dublin Core:Relation","Dublin Core:Format","Dublin Core:Language","Dublin Core:Type","Dublin Core:Identifier","Dublin Core:Coverage","Item Type Metadata:Text","Item Type Metadata:Interviewer","Item Type Metadata:Interviewee","Item Type Metadata:Location","Item Type Metadata:Transcription","Item Type Metadata:Local URL","Item Type Metadata:Original Format","Item Type Metadata:Physical Dimensions","Item Type Metadata:Duration","Item Type Metadata:Compression","Item Type Metadata:Producer","Item Type Metadata:Director","Item Type Metadata:Bit Rate/Frequency","Item Type Metadata:Time Summary","Item Type Metadata:Email Body","Item Type Metadata:Subject Line","Item Type Metadata:From","Item Type Metadata:To","Item Type Metadata:CC","Item Type Metadata:BCC","Item Type Metadata:Number of Attachments","Item Type Metadata:Standards","Item Type Metadata:Objectives","Item Type Metadata:Materials","Item Type Metadata:Lesson Plan Text","Item Type Metadata:URL","Item Type Metadata:Event Type","Item Type Metadata:Participants","Item Type Metadata:Birth Date","Item Type Metadata:Birthplace","Item Type Metadata:Death Date","Item Type Metadata:Occupation","Item Type Metadata:Biographical Text","Item Type Metadata:Bibliography",tags,file,itemType,collection,public,featured
"Véritable Arbre à Vernis",,,,,,,,,,Planche,français,"Gravure sur cuivre",ID_130-1_020_web,,,,,,,,,,,,,,,,,,,,,,,,,,,,,,,,,,,,"Arbre,Botanique,Branche,Feuille,Japon,Toxicodendron vernicifluum,Vernis du Japon",https://hieronyma.ict-toulouse.fr/files/original/b03a11cb145ecbd9f2066f237e387571.JPG,"Image fixe","Histoire du Japon",1,0
"Faux Arbre à Vernis",,,,,,,,,,Planche,français,"Gravure sur cuivre",ID_130-1_021_web,,,,,,,,,,,,,,,,,,,,,,,,,,,,,,,,,,,,"Ailanthus altissima,Arbre,Botanique,Branche,Faux vernis du Japon,Feuille,Japon",https://hieronyma.ict-toulouse.fr/files/original/6789de46d4c1af20646b026cf8e95851.JPG,"Image fixe","Histoire du Japon",1,0
"Arbrisseau de Thé",,,,,,,,,,Planche,français,"Gravure sur cuivre",ID_130-1_022_web,,,,,,,,,,,,,,,,,,,,,,,,,,,,,,,,,,,,"Botanique,Branche,Camellia sinensis,Fleur,Fruit,Japon,Théier",https://hieronyma.ict-toulouse.fr/files/original/0a5513b14593602bfebf0a67d1d602f4.JPG,"Image fixe","Histoire du Japon",1,0
"[Page de titre]",,,,,,,,,,"Pleine page",,,X_447_001_web,,,,,,,,,,,,,,,,,,,,,,,,,,,,,,,,,,,,Botanique,https://hieronyma.ict-toulouse.fr/files/original/cca466bfe2ec4e9f356a621e7263e2ea.jpg,"Image fixe","Histoire des plantes d'Europe",1,0
"43. L'Iris foetide. 44. L'Iris des marais.",,,,,,,,,,Vignette,,"Gravure sur bois",X_447_002_web,,,,,,,,,,,,,,,,,,,,,,,,,,,,,,,,,,,,"Botanique,Iris des marais,Iris fétide,Iris foetidissima,Iris pseudacorus,Plante",https://hieronyma.ict-toulouse.fr/files/original/4a4f5524a6f6439eac85689b99dd5855.jpg,"Image fixe","Histoire des plantes d'Europe",1,0
"68. Le Panic sanguin. 69. Le Panic italique.",,,,,,,,,,Vignette,,"Gravure sur bois",X_447_003_web,,,,,,,,,,,,,,,,,,,,,,,,,,,,,,,,,,,,"Botanique,Digitaire commune,Digitaria sanguinalis,Herbe,Millet d'Italie,Setaria italica",https://hieronyma.ict-toulouse.fr/files/original/22af8451dc4ba7d29d6dabe375371110.jpg,"Image fixe","Histoire des plantes d'Europe",1,0
"403. La Perce-neige ou Leucoie printanier. 405. Le Narcisse faux Narcisse.",,,,,,,,,,Vignette,,"Gravure sur bois",X_447_004_web,,,,,,,,,,,,,,,,,,,,,,,,,,,,,,,,,,,,"Botanique,Fleur,Leucojum vernum,Narcisse jaune,Narcissus pseudonarcissus,Nivéole de printemps,Plante",https://hieronyma.ict-toulouse.fr/files/original/f6dff3f8358bb7beae3cce0e9eaefe21.jpg,"Image fixe","Histoire des plantes d'Europe",1,0
"846. Le Raifort cultivé. 847. Le Velar officinal.",,,,,,,,,,Vignette,,"Gravure sur bois",X_447_005_web,,,,,,,,,,,,,,,,,,,,,,,,,,,,,,,,,,,,"Botanique,Herbe aux chantres,Légume,Plante,Radis cultivé,Raphanus sativus,Sisymbrium officinale",https://hieronyma.ict-toulouse.fr/files/original/d2a16857d2a1bb469ee0c2f603f1fcae.jpg,"Image fixe","Histoire des plantes d'Europe",1,0
"912. La Mauve alcée. 913. L'Alcée rose, ou trémiere",,,,,,,,,,Vignette,,"Gravure sur bois",X_447_006_web,,,,,,,,,,,,,,,,,,,,,,,,,,,,,,,,,,,,"Alcea rosea,Botanique,Fleur,Malva alcea,Mauve alcée,Passe-rose,Plante",https://hieronyma.ict-toulouse.fr/files/original/a984eba0efbc6d085148b65cff825376.jpg,"Image fixe","Histoire des plantes d'Europe",1,1
"1168. L'Archilliere sternutatoire. 1169. L'Achilliere millefeuilles.",,,,,,,,,,Vignette,,"Gravure sur bois",X_447_007_web,,,,,,,,,,,,,,,,,,,,,,,,,,,,,,,,,,,,"Achillea millefolium,Achillea ptarmica,Achillée millefeuille,Achillée ptarmique,Botanique,Fleur,Plante",https://hieronyma.ict-toulouse.fr/files/original/43b721b8f517f5fcddf82db1a18f5962.jpg,"Image fixe","Histoire des plantes d'Europe",1,0
