﻿"Dublin Core:Title","Dublin Core:Subject","Dublin Core:Description","Dublin Core:Creator","Dublin Core:Source","Dublin Core:Publisher","Dublin Core:Date","Dublin Core:Contributor","Dublin Core:Rights","Dublin Core:Relation","Dublin Core:Format","Dublin Core:Language","Dublin Core:Type","Dublin Core:Identifier","Dublin Core:Coverage","Item Type Metadata:Text","Item Type Metadata:Interviewer","Item Type Metadata:Interviewee","Item Type Metadata:Location","Item Type Metadata:Transcription","Item Type Metadata:Local URL","Item Type Metadata:Original Format","Item Type Metadata:Physical Dimensions","Item Type Metadata:Duration","Item Type Metadata:Compression","Item Type Metadata:Producer","Item Type Metadata:Director","Item Type Metadata:Bit Rate/Frequency","Item Type Metadata:Time Summary","Item Type Metadata:Email Body","Item Type Metadata:Subject Line","Item Type Metadata:From","Item Type Metadata:To","Item Type Metadata:CC","Item Type Metadata:BCC","Item Type Metadata:Number of Attachments","Item Type Metadata:Standards","Item Type Metadata:Objectives","Item Type Metadata:Materials","Item Type Metadata:Lesson Plan Text","Item Type Metadata:URL","Item Type Metadata:Event Type","Item Type Metadata:Participants","Item Type Metadata:Birth Date","Item Type Metadata:Birthplace","Item Type Metadata:Death Date","Item Type Metadata:Occupation","Item Type Metadata:Biographical Text","Item Type Metadata:Bibliography",tags,file,itemType,collection,public,featured
"[L'apparition du Christ aux Apôtres. L'Ascension]",,,,,,,,,,Vignettes,latin,"Gravure sur bois",PAT_16M_022_387_web,,,,,,,,,,,,,,,,,,,,,,,,,,,,,,,,,,,,"Apparition aux apôtres,Apparition du Christ,Ascension,Christ,Ciel,Évangile selon saint Luc,Les Apôtres,Rayons lumineux,Résurrection,Saint Thomas",https://hieronyma.ict-toulouse.fr/files/original/5ead8af9c1dd4b540cfde66a967842d0.jpg,,"[Bible, latin, 1574]",1,0
"[Les Saintes Femmes au tombeau. Les pèlerins d'Emmaüs]",,,,,,,,,,Vignettes,latin,"Gravure sur bois",PAT_16M_022_386_web,,,,,,,,,,,,,,,,,,,,,,,,,,,,,,,,,,,,"Ange,Apparition,Apparition du Christ,Bâton,Christ,Emmaüs,Évangile selon saint Luc,La Résurrection,Les Saintes Femmes,Les Saintes Femmes au tombeau,Parfum,Pèlerin,Pèlerins d'Emmaüs,Tombeau",https://hieronyma.ict-toulouse.fr/files/original/695805454a277cdd1a8885ff37723552.jpg,,"[Bible, latin, 1574]",1,0
"[Scènes de la Résurrection]",,,,,,,,,,Vignettes,latin,"Gravure sur bois",PAT_16M_022_353_web,,,,,,,,,,,,,,,,,,,,,,,,,,,,,,,,,,,,"Ange,Apparition,Apparition à Madeleine,Apparition du Christ,Ascension,Bâton,Christ,Emmaüs,Évangile selon saint Marc,Jardinier,La Résurrection,Les Apôtres,Les Saintes Femmes,Les Saintes Femmes au tombeau,Pèlerin,Pèlerins d'Emmaüs,Rayons lumineux,Sainte Madeleine,Tombeau",https://hieronyma.ict-toulouse.fr/files/original/6851f1b74b08fae5b8d3fcec89363164.jpg,,"[Bible, latin, 1574]",1,0
"Apparition de J.C. sur le bord du lac de Genesareth. Pesche miraculeuse.",,,,,,,,,,"Image mi-page","français ; latin","Gravure sur cuivre",PAT_18G_001_225b,,,,,,,,,,,,,,,,,,,,,,,,,,,,,,,,,,,,"Apparition aux apôtres,Apparition du Christ,Bateau,Christ,Cuisson,Évangile selon saint Jean,Filet,Lac,Les Apôtres,Pêche,Poisson,Rive,Saint Pierre",https://hieronyma.ict-toulouse.fr/files/original/54667c9112c6ab4f3b0109b17520af56.JPG,,"L'Ancien et le Nouveau Testament représentés en cinq cens tableaux gravés d'après les desseins de Raphaël & autres grands maîtres et expliqués par les paroles de l'Ecriture",1,0
"Jesus apparoit a Marie Madeleine qui le prend pour le jardinier.",,,,,,,,,,"Image mi-page","français ; latin","Gravure sur cuivre",PAT_18G_001_223b,,,,,,,,,,,,,,,,,,,,,,,,,,,,,,,,,,,,"Apparition à Madeleine,Apparition du Christ,Christ,Évangile selon saint Jean,Jardin,Jardinier,La Résurrection,Outil,Sainte Madeleine",https://hieronyma.ict-toulouse.fr/files/original/ddf3c87f6fd98fbcb1223377e69295c9.JPG,,"L'Ancien et le Nouveau Testament représentés en cinq cens tableaux gravés d'après les desseins de Raphaël & autres grands maîtres et expliqués par les paroles de l'Ecriture",1,0
"Jesus avec les deux disciples d'Emmaus.",,,,,,,,,,"Image mi-page","français ; latin","Gravure sur cuivre",PAT_18G_001_224a,,,,,,,,,,,,,,,,,,,,,,,,,,,,,,,,,,,,"Apparition du Christ,Discussion,Évangile selon saint Luc,Pèlerin,Pèlerins d'Emmaüs,Voyageur",https://hieronyma.ict-toulouse.fr/files/original/33272046cf458fad4e1b23d6b4c8db19.JPG,,"L'Ancien et le Nouveau Testament représentés en cinq cens tableaux gravés d'après les desseins de Raphaël & autres grands maîtres et expliqués par les paroles de l'Ecriture",1,0
"Jesus Christ est reconnu par les disciples d'Emmaüs.",,,,,,,,,,"Image mi-page","français ; latin","Gravure sur cuivre",PAT_18G_001_224b,,,,,,,,,,,,,,,,,,,,,,,,,,,,,,,,,,,,"Apparition du Christ,Chien,Christ,Évangile selon saint Luc,Pain,Pèlerin,Pèlerins d'Emmaüs,Repas,Table",https://hieronyma.ict-toulouse.fr/files/original/5e3268baa66db7abc2d72314b3818f37.JPG,,"L'Ancien et le Nouveau Testament représentés en cinq cens tableaux gravés d'après les desseins de Raphaël & autres grands maîtres et expliqués par les paroles de l'Ecriture",1,0
"Jésus et les disciples d’Emmaüs.",,,,,,,,,,Planche,,"Gravure sur acier",1133_SAI_2_093_web,,,,,,,,,,,,,,,,,,,,,,,,,,,,,,,,,,,,"Apparition du Christ,Christ,Évangile selon saint Luc,Pèlerins d'Emmaüs,Village,Voyageur",https://hieronyma.ict-toulouse.fr/files/original/195a2ea8788635dfc81f12d25c575507.JPG,,"La Sainte Bible : traduction nouvelle selon la Vulgate",1,0
"St Thomas voit et touche les playes du sauveur.",,,,,,,,,,"Image mi-page","français ; latin","Gravure sur cuivre",PAT_18G_001_225a,,,,,,,,,,,,,,,,,,,,,,,,,,,,,,,,,,,,"Apparition à Thomas,Apparition du Christ,Blessé,Christ,Évangile selon saint Jean,Les Apôtres,Livre,Matériel d'écriture,Saint Thomas",https://hieronyma.ict-toulouse.fr/files/original/350e096fb7a30abceac9f5b4b029b55f.JPG,,"L'Ancien et le Nouveau Testament représentés en cinq cens tableaux gravés d'après les desseins de Raphaël & autres grands maîtres et expliqués par les paroles de l'Ecriture",1,0
