﻿"Dublin Core:Title","Dublin Core:Subject","Dublin Core:Description","Dublin Core:Creator","Dublin Core:Source","Dublin Core:Publisher","Dublin Core:Date","Dublin Core:Contributor","Dublin Core:Rights","Dublin Core:Relation","Dublin Core:Format","Dublin Core:Language","Dublin Core:Type","Dublin Core:Identifier","Dublin Core:Coverage","Item Type Metadata:Text","Item Type Metadata:Interviewer","Item Type Metadata:Interviewee","Item Type Metadata:Location","Item Type Metadata:Transcription","Item Type Metadata:Local URL","Item Type Metadata:Original Format","Item Type Metadata:Physical Dimensions","Item Type Metadata:Duration","Item Type Metadata:Compression","Item Type Metadata:Producer","Item Type Metadata:Director","Item Type Metadata:Bit Rate/Frequency","Item Type Metadata:Time Summary","Item Type Metadata:Email Body","Item Type Metadata:Subject Line","Item Type Metadata:From","Item Type Metadata:To","Item Type Metadata:CC","Item Type Metadata:BCC","Item Type Metadata:Number of Attachments","Item Type Metadata:Standards","Item Type Metadata:Objectives","Item Type Metadata:Materials","Item Type Metadata:Lesson Plan Text","Item Type Metadata:URL","Item Type Metadata:Event Type","Item Type Metadata:Participants","Item Type Metadata:Birth Date","Item Type Metadata:Birthplace","Item Type Metadata:Death Date","Item Type Metadata:Occupation","Item Type Metadata:Biographical Text","Item Type Metadata:Bibliography",tags,file,itemType,collection,public,featured
"[Page de titre]",,,,,,,,,,"Pleine page",,,PAT_18M_024_001_web,,,,,,,,,,,,,,,,,,,,,,,,,,,,,,,,,,,,"Allégorie,Église,France,Jacques Bénigne Bossuet",https://hieronyma.ict-toulouse.fr/files/original/765a1091b278bcfbf5dfe8e10668c5d2.JPG,"Image fixe","Defensio declarationis",1,0
"[L'Église de France et le pape Innocent XI]",,,,,,,,,,Vignette,,"Gravure sur cuivre",PAT_18M_024_002_web,,,,,,,,,,,,,,,,,,,,,,,,,,,,,,,,,,,,"Allégorie,Balance,Cardinal,Croix,Église,Fleur de lys,France,Innocent XI (pape, 1611-1689),Jacques Bénigne Bossuet,Pape,Sceau,Traité",https://hieronyma.ict-toulouse.fr/files/original/8daf93334b55c2d27013a394730df7d5.JPG,"Image fixe","Defensio declarationis",1,0
"[Page de titre]",,,,,,,,,,"Pleine page",,,PAT_17M_279_000_web,,,,,,,,,,,,,,,,,,,,,,,,,,,,,,,,,,,,"Allégorie,Hercule,Saturne,Savignac",https://hieronyma.ict-toulouse.fr/files/original/164da417e98c78b5c03ad6f569d5c267.JPG,"Image fixe","Histoire du concile de Trente",1,0
"[Marque des imprimeurs Joan II et Pieter Blaeu]",,"Inscription dans le phylactère : ""Indefessus agendo""",,,,,,,,"Marque d'imprimeur",,"Gravure sur bois",PAT_17M_279_001_web,,,,,,,,,,,,,,,,,,,,,,,,,,,,,,,,,,,,"Allégorie,Faux,Force,Hercule,Le temps,Massue,Nuée,Phylactère,Sablier,Saturne,Savignac,Sphère",https://hieronyma.ict-toulouse.fr/files/original/d2027967883182881511265a4fc74bd5.JPG,"Image fixe","Histoire du concile de Trente",1,0
"[Pleine page]",,,,,,,,,,"Pleine page",,,PAT_18P_339_001_web,,,,,,,,,,,,,,,,,,,,,,,,,,,,,,,,,,,,"Allégorie,Église,L'Europe ecclésiastique,Lettre L,Savignac",https://hieronyma.ict-toulouse.fr/files/original/dca8773e0c45a11ba8dcd56464167bc7.JPG,"Image fixe","L'Europe ecclésiastique",1,0
"[Bandeau : allégorie de l'Église]",,,,,,,,,,"Ornement typographique",,"Gravure sur bois",PAT_18P_339_002_web,,,,,,,,,,,,,,,,,,,,,,,,,,,,,,,,,,,,"Allégorie,Croix,Église,Encensoir,L'Europe ecclésiastique,Livre,Savignac",https://hieronyma.ict-toulouse.fr/files/original/f297e0b7de75417e3edcbae807266bae.JPG,"Image fixe","L'Europe ecclésiastique",1,0
"Henriade, Chant IV",,,,,,,,,,Planche,,"Gravure sur cuivre",PAT_18P_179_006_web,,,,,,,,,,,,,,,,,,,,,,,,,,,,,,,,,,,,"Aile,Allégorie,Charles de Lorraine (1554-1611, duc de Mayenne),Discorde,En vol,JEP2019,Réunion,Rome,Torche",https://hieronyma.ict-toulouse.fr/files/original/f6cffe5873fd105d2986fc1c676180da.jpg,"Image fixe","La Henriade. 1787",1,0
"Henriade, Chant X",,,,,,,,,,Planche,,"Gravure sur cuivre",PAT_18P_179_019_web,,,,,,,,,,,,,,,,,,,,,,,,,,,,,,,,,,,,"Allégorie,Cavalier,Henri IV (1553-1610, roi de France),JEP2019,L'Église,Soleil,Vérité",https://hieronyma.ict-toulouse.fr/files/original/069f906bb1061bdd674eca235fda1a48.jpg,"Image fixe","La Henriade. 1787",1,0
"[Plat supérieur (détail) : scène allégorique]",,,,,,,,,,Reliure,,"Peau de truie estampée à froid",RES_16G_020_003_web,,,,,,,,,,,,,,,,,,,,,,,,,,,,,,,,,,,,"Allégorie,Arc,Le temps,Mort,Robert Estienne,Sablier,Sommeil,Squelette",https://hieronyma.ict-toulouse.fr/files/original/eba4fd2f7d548f6aff5ef3a5c3ec640d.JPG,"Image fixe","[Bible, N.T., grec ancien, 1550]",1,0
"[Plat supérieur (détail) : Allégories]",,,,,,,,,,Reliure,,"Peau de truie estampée à froid",RES_16G_020_009_web,,,,,,,,,,,,,,,,,,,,,,,,,,,,,,,,,,,,"Allégorie,Calice,Colombe,Croix,Dieu le Père,Globe,Hostie,L'Église,Rayons lumineux,Robert Estienne,Saint-Esprit",https://hieronyma.ict-toulouse.fr/files/original/afb4eca775265ee5cecf7cee784d6451.JPG,"Image fixe","[Bible, N.T., grec ancien, 1550]",1,0
