﻿"Dublin Core:Title","Dublin Core:Subject","Dublin Core:Description","Dublin Core:Creator","Dublin Core:Source","Dublin Core:Publisher","Dublin Core:Date","Dublin Core:Contributor","Dublin Core:Rights","Dublin Core:Relation","Dublin Core:Format","Dublin Core:Language","Dublin Core:Type","Dublin Core:Identifier","Dublin Core:Coverage","Item Type Metadata:Text","Item Type Metadata:Interviewer","Item Type Metadata:Interviewee","Item Type Metadata:Location","Item Type Metadata:Transcription","Item Type Metadata:Local URL","Item Type Metadata:Original Format","Item Type Metadata:Physical Dimensions","Item Type Metadata:Duration","Item Type Metadata:Compression","Item Type Metadata:Producer","Item Type Metadata:Director","Item Type Metadata:Bit Rate/Frequency","Item Type Metadata:Time Summary","Item Type Metadata:Email Body","Item Type Metadata:Subject Line","Item Type Metadata:From","Item Type Metadata:To","Item Type Metadata:CC","Item Type Metadata:BCC","Item Type Metadata:Number of Attachments","Item Type Metadata:Standards","Item Type Metadata:Objectives","Item Type Metadata:Materials","Item Type Metadata:Lesson Plan Text","Item Type Metadata:URL","Item Type Metadata:Event Type","Item Type Metadata:Participants","Item Type Metadata:Birth Date","Item Type Metadata:Birthplace","Item Type Metadata:Death Date","Item Type Metadata:Occupation","Item Type Metadata:Biographical Text","Item Type Metadata:Bibliography",tags,file,itemType,collection,public,featured
"Corbeaux d'Elie. Ezéchias reçoit la santé",,,,,,,,,,"Pleine page",,"Gravure sur cuivre",PAT_19P_004_006_web,,,,,,,,,,,,,,,,,,,,,,,,,,,,,,,,,,,,"Corbeau,Couronne,Cours d'eau,Élie,Ézéchias,Guérison miraculeuse,Nourriture,Savignac,Sceptre",https://hieronyma.ict-toulouse.fr/files/original/f57694022b675e870d41cf40b23a2242.jpg,"Image fixe","Histoire de la Sainte Bible...",1,0
"La Transfiguration",,,,,,,,,,Planche,,"Gravure sur acier",1133_SAI_2_058_web,,,,,,,,,,,,,,,,,,,,,,,,,,,,,,,,,,,,"Apparition,Christ,Élie,Évangile selon saint Matthieu,Les Tables de la Loi,Moïse,Montagne,Rayons lumineux,Saint Jacques le Majeur,Saint Jean,Saint Pierre,Transfiguration",https://hieronyma.ict-toulouse.fr/files/original/b187749e95cd49d12e5ede8732041f83.JPG,,"La Sainte Bible : traduction nouvelle selon la Vulgate",1,0
"[Jésus enseignant. La Transfiguration]",,,,,,,,,,Vignettes,latin,"Gravure sur bois",PAT_16M_022_316_web,,,,,,,,,,,,,,,,,,,,,,,,,,,,,,,,,,,,"Apparition,Christ,Christ enseignant,Élie,Évangile selon saint Matthieu,Les Tables de la Loi,Moïse,Rayons lumineux,Saint Jacques le Majeur,Saint Jean,Saint Pierre,Transfiguration",https://hieronyma.ict-toulouse.fr/files/original/2e60532def7ed8e955c2a8151dfa1e1e.jpg,,"[Bible, latin, 1574]",1,0
"[Guérison d'un aveugle. La Transfiguration]",,,,,,,,,,Vignettes,latin,"Gravure sur bois",PAT_16M_022_342_web,,,,,,,,,,,,,,,,,,,,,,,,,,,,,,,,,,,,"Apparition,Aveugle,Bâton,Élie,Évangile selon saint Marc,Jésus guérissant,Les Tables de la Loi,Miracle du Christ,Moïse,Rayons lumineux,Saint Jacques le Majeur,Saint Jean,Saint Pierre,Transfiguration",https://hieronyma.ict-toulouse.fr/files/original/884f02c47139b2f7fcaa814cfe25547a.jpg,,"[Bible, latin, 1574]",1,0
"[La Transfiguration. Jésus guérit un enfant possédé. Le Christ enseignant]",,,,,,,,,,Vignettes,latin,"Gravure sur bois",PAT_16M_022_369_web,,,,,,,,,,,,,,,,,,,,,,,,,,,,,,,,,,,,"Apparition,Bénédiction,Christ,Christ enseignant,Délivrance de possédé,Élie,Enfant,Évangile selon saint Luc,Jésus guérissant,Les Tables de la Loi,Moïse,Rayons lumineux,Saint Jacques le Majeur,Saint Jean,Saint Pierre,Transfiguration",https://hieronyma.ict-toulouse.fr/files/original/8fab6dd576c98f9d94710ab14e189589.jpg,,"[Bible, latin, 1574]",1,0
"Élie nourri par des corbeaux.",,,,,,,,,,"Image mi-page","français ; latin","Gravure sur cuivre",PAT_18G_001_125b,,,,,,,,,,,,,,,,,,,,,,,,,,,,,,,,,,,,"Corbeau,Élie,Nourriture,Pain,Premier Livre des Rois,Prophète,Torrent",https://hieronyma.ict-toulouse.fr/files/original/08472655483fd935d2bb5215638023b1.JPG,,"L'Ancien et le Nouveau Testament représentés en cinq cens tableaux gravés d'après les desseins de Raphaël & autres grands maîtres et expliqués par les paroles de l'Ecriture",1,0
"Holocauste d'Elie consumé par le feu du ciel.",,,,,,,,,,"Image mi-page","français ; latin","Gravure sur cuivre",PAT_18G_001_126b,,,,,,,,,,,,,,,,,,,,,,,,,,,,,,,,,,,,"Achab,Autel,Eau,Élie,Feu,Premier Livre des Rois,Prophète,Sacrifice,Vase",https://hieronyma.ict-toulouse.fr/files/original/97f62567fd52a20147f13e5f23f9a128.JPG,,"L'Ancien et le Nouveau Testament représentés en cinq cens tableaux gravés d'après les desseins de Raphaël & autres grands maîtres et expliqués par les paroles de l'Ecriture",1,0
"Elie obtient de la pluye par ses prieres.",,,,,,,,,,"Image mi-page","français ; latin","Gravure sur cuivre",PAT_18G_001_127a,,,,,,,,,,,,,,,,,,,,,,,,,,,,,,,,,,,,"Élie,Miracle,Mont Carmel,Pluie,Premier Livre des Rois,Prière,Prophète,Serviteur",https://hieronyma.ict-toulouse.fr/files/original/4714a08558692483aa3e20d4dfa619da.JPG,,"L'Ancien et le Nouveau Testament représentés en cinq cens tableaux gravés d'après les desseins de Raphaël & autres grands maîtres et expliqués par les paroles de l'Ecriture",1,0
"Un ange nourrit Élie dans le desert.",,,,,,,,,,"Image mi-page","français ; latin","Gravure sur cuivre",PAT_18G_001_127b,,,,,,,,,,,,,,,,,,,,,,,,,,,,,,,,,,,,"Ange,Désert,Eau,Élie,Nourriture,Pain,Premier Livre des Rois,Prophète,Sommeil",https://hieronyma.ict-toulouse.fr/files/original/16be910e1d8ea866bf8d135c0e21b905.JPG,,"L'Ancien et le Nouveau Testament représentés en cinq cens tableaux gravés d'après les desseins de Raphaël & autres grands maîtres et expliqués par les paroles de l'Ecriture",1,0
"Elie enlevé dans un char de feu.",,,,,,,,,,"Image mi-page","français ; latin","Gravure sur cuivre",PAT_18G_001_129a,,,,,,,,,,,,,,,,,,,,,,,,,,,,,,,,,,,,"Char,Cheval,Deuxième Livre des Rois,Élie,Élisée,Feu,Orage,Prophète,Rayons lumineux",https://hieronyma.ict-toulouse.fr/files/original/356e730bfff3c18326d47f0b5ed90330.JPG,,"L'Ancien et le Nouveau Testament représentés en cinq cens tableaux gravés d'après les desseins de Raphaël & autres grands maîtres et expliqués par les paroles de l'Ecriture",1,0
