﻿"Dublin Core:Title","Dublin Core:Subject","Dublin Core:Description","Dublin Core:Creator","Dublin Core:Source","Dublin Core:Publisher","Dublin Core:Date","Dublin Core:Contributor","Dublin Core:Rights","Dublin Core:Relation","Dublin Core:Format","Dublin Core:Language","Dublin Core:Type","Dublin Core:Identifier","Dublin Core:Coverage","Item Type Metadata:Text","Item Type Metadata:Interviewer","Item Type Metadata:Interviewee","Item Type Metadata:Location","Item Type Metadata:Transcription","Item Type Metadata:Local URL","Item Type Metadata:Original Format","Item Type Metadata:Physical Dimensions","Item Type Metadata:Duration","Item Type Metadata:Compression","Item Type Metadata:Producer","Item Type Metadata:Director","Item Type Metadata:Bit Rate/Frequency","Item Type Metadata:Time Summary","Item Type Metadata:Email Body","Item Type Metadata:Subject Line","Item Type Metadata:From","Item Type Metadata:To","Item Type Metadata:CC","Item Type Metadata:BCC","Item Type Metadata:Number of Attachments","Item Type Metadata:Standards","Item Type Metadata:Objectives","Item Type Metadata:Materials","Item Type Metadata:Lesson Plan Text","Item Type Metadata:URL","Item Type Metadata:Event Type","Item Type Metadata:Participants","Item Type Metadata:Birth Date","Item Type Metadata:Birthplace","Item Type Metadata:Death Date","Item Type Metadata:Occupation","Item Type Metadata:Biographical Text","Item Type Metadata:Bibliography",tags,file,itemType,collection,public,featured
"[Caractères en ancien syriaques et grecs]",,,,,,,,,,Planche,"ancien syriaque ; grec","Gravure sur cuivre",PAT_18P_280-9_024_web,,,,,,,,,,,,,,,,,,,,,,,,,,,,,,,,,,,,"Écriture,Iran",https://hieronyma.ict-toulouse.fr/files/original/d4979109131d950a86cee3490bb98327.jpg,,"Voyages de Mr. Le Chevalier Chardin, en Perse, et autres lieux de l'Orient. Tome Neuvième",1,0
"[Caractères arabes]",,,,,,,,,,Planche,arabe,"Gravure sur cuivre",PAT_18P_280-9_023_web,,,,,,,,,,,,,,,,,,,,,,,,,,,,,,,,,,,,"Écriture,Iran",https://hieronyma.ict-toulouse.fr/files/original/aaa0e3590c2786e9d664e4ea4575b9d7.jpg,,"Voyages de Mr. Le Chevalier Chardin, en Perse, et autres lieux de l'Orient. Tome Neuvième",1,0
"[Caractères arabes]",,,,,,,,,,Planche,arabe,"Gravure sur cuivre",PAT_18P_280-9_022_web,,,,,,,,,,,,,,,,,,,,,,,,,,,,,,,,,,,,"Écriture,Iran",https://hieronyma.ict-toulouse.fr/files/original/ab845a4f9bd6d829527f1c8876742dcf.jpg,,"Voyages de Mr. Le Chevalier Chardin, en Perse, et autres lieux de l'Orient. Tome Neuvième",1,0
"[Exemple d'inscriptions de Persépolis]",,,,,,,,,,Planche,,"Gravure sur cuivre",PAT_18P_280-9_020_web,,,,,,,,,,,,,,,,,,,,,,,,,,,,,,,,,,,,"Écriture,Iran,Persépolis (ville ancienne),Ruines",https://hieronyma.ict-toulouse.fr/files/original/4a9a9bec9d1898286bce585ff4d74555.jpg,,"Voyages de Mr. Le Chevalier Chardin, en Perse, et autres lieux de l'Orient. Tome Neuvième",1,0
"Les festes du mois d'avril : Ste Marie Egyptien[ne], St George, St F. de Paule, St Vincent, St Marc, S. Ambroise, S. Oportune, St Pierre Martyr, S. Robert",,,,,,,,,,"Image pleine page",français,"Gravure sur cuivre",PAT_17G_193_008_web,,,,,,,,,,,,,,,,,,,,,,,,,,,,,,,,,,,,"Abbesse,Calice,Chevalier,Christ en croix,Crosse,Crucifix,Dominicain,Dragon,Écriture,Enfant,Évêque,Femme,Flamme,Grotte,Lecture,Lion,Livre,Martyre,Matériel d'écriture,Mise à mort,Mort par le fer,Palme,Prière,Religieux,Saint Ambroise de Milan,Saint François de Paule,Saint Georges,Saint Marc,Saint Pierre de Vérone,Saint Robert de la Chaise-Dieu,Saint Vincent Ferrier,Sainte Marie l'Égyptienne,Sainte Opportune",https://hieronyma.ict-toulouse.fr/files/original/62a305566f9e05963b9c612a8b6042fd.jpg,,"Les Fleurs des Vies des saints... [1678]",1,0
"Les festes du mois de mars : l'Ange gardien, St Joseph, St Cyrille, S. Gregoire, [l'Annonciation], S. Benoist, S. Gertrude, St Thomas, S. Jean [Climaque]",,,,,,,,,,"Image pleine page",français,"Gravure sur cuivre",PAT_17G_193_007_web,,,,,,,,,,,,,,,,,,,,,,,,,,,,,,,,,,,,"Abbesse,Ange,Annonciation,Auréole,Chambre,Chape,Colombe,Crâne,Crosse,Crucifix,Dominicain,Écriture,Enfant Jésus,Évêque,Livre,Lys,Mitre,Pain,Pape,Prière,Rayons lumineux,Religieux,Saint Benoît de Nursie,Saint Cyrille de Jérusalem,Saint Gabriel,Saint Grégoire le Grand,Saint Jean Climaque,Saint Joseph,Saint Thomas d'Aquin,Saint-Esprit,Sainte Gertrude de Nivelles,Tiare,Vierge",https://hieronyma.ict-toulouse.fr/files/original/17cee503f35e07239fbed36a0cf24caa.jpg,,"Les Fleurs des Vies des saints... [1678]",1,0
"Jesus juge la femme surprise en adultere",,,,,,,,,,"Image mi-page","français ; latin","Gravure sur cuivre",PAT_18G_001_197b,,,,,,,,,,,,,,,,,,,,,,,,,,,,,,,,,,,,"Accusation,Christ,Écriture,Évangile selon saint Jean,Femme,La femme adultère,Le Temple",https://hieronyma.ict-toulouse.fr/files/original/5edb3d2f6fcf1dcb381c13c153ea46be.JPG,,"L'Ancien et le Nouveau Testament représentés en cinq cens tableaux gravés d'après les desseins de Raphaël & autres grands maîtres et expliqués par les paroles de l'Ecriture",1,0
"Dénombrement de la Judée par édit d'Auguste",,,,,,,,,,"Image mi-page","français ; latin","Gravure sur cuivre",PAT_18G_001_169a,,,,,,,,,,,,,,,,,,,,,,,,,,,,,,,,,,,,"Écriture,Évangile selon saint Luc,Foule,Grossesse,Recensement,Saint Joseph,Vierge",https://hieronyma.ict-toulouse.fr/files/original/39d2bfdbc46c02672f23bbc258d7aa26.JPG,,"L'Ancien et le Nouveau Testament représentés en cinq cens tableaux gravés d'après les desseins de Raphaël & autres grands maîtres et expliqués par les paroles de l'Ecriture",1,0
"Le fils de Zacharie est circoncis, et nommé Jean",,,,,,,,,,"Image mi-page","français ; latin","Gravure sur cuivre",PAT_18G_001_168a,,,,,,,,,,,,,,,,,,,,,,,,,,,,,,,,,,,,"Circoncision,Écriture,Évangile selon saint Luc,Muet,Nourrisson,Prêtre,Saint Jean Baptiste,Saint Zacharie,Sainte Elisabeth,Tablette",https://hieronyma.ict-toulouse.fr/files/original/a4367fe9edca9e4b651f335d6f13b0a4.JPG,,"L'Ancien et le Nouveau Testament représentés en cinq cens tableaux gravés d'après les desseins de Raphaël & autres grands maîtres et expliqués par les paroles de l'Ecriture",1,0
"St. Jean",,"La légende est extraite des <em>Homélies sur l'Évangile de saint Jean</em> de saint Augustin (Homélie XXXVI).",,,,,,,,"Image mi-page","français ; latin","Gravure sur cuivre",PAT_18G_001_165b,,,,,,,,,,,,,,,,,,,,,,,,,,,,,,,,,,,,"Aigle de saint Jean,Augustin (0354-0430). Homélies sur l'Évangile de saint Jean,Écriture,Matériel d'écriture,Portrait,Rouleau,Saint Jean",https://hieronyma.ict-toulouse.fr/files/original/5667ae7610702cc418af38f16cdfac35.JPG,,"L'Ancien et le Nouveau Testament représentés en cinq cens tableaux gravés d'après les desseins de Raphaël & autres grands maîtres et expliqués par les paroles de l'Ecriture",1,0
