﻿"Dublin Core:Title","Dublin Core:Subject","Dublin Core:Description","Dublin Core:Creator","Dublin Core:Source","Dublin Core:Publisher","Dublin Core:Date","Dublin Core:Contributor","Dublin Core:Rights","Dublin Core:Relation","Dublin Core:Format","Dublin Core:Language","Dublin Core:Type","Dublin Core:Identifier","Dublin Core:Coverage","Item Type Metadata:Text","Item Type Metadata:Interviewer","Item Type Metadata:Interviewee","Item Type Metadata:Location","Item Type Metadata:Transcription","Item Type Metadata:Local URL","Item Type Metadata:Original Format","Item Type Metadata:Physical Dimensions","Item Type Metadata:Duration","Item Type Metadata:Compression","Item Type Metadata:Producer","Item Type Metadata:Director","Item Type Metadata:Bit Rate/Frequency","Item Type Metadata:Time Summary","Item Type Metadata:Email Body","Item Type Metadata:Subject Line","Item Type Metadata:From","Item Type Metadata:To","Item Type Metadata:CC","Item Type Metadata:BCC","Item Type Metadata:Number of Attachments","Item Type Metadata:Standards","Item Type Metadata:Objectives","Item Type Metadata:Materials","Item Type Metadata:Lesson Plan Text","Item Type Metadata:URL","Item Type Metadata:Event Type","Item Type Metadata:Participants","Item Type Metadata:Birth Date","Item Type Metadata:Birthplace","Item Type Metadata:Death Date","Item Type Metadata:Occupation","Item Type Metadata:Biographical Text","Item Type Metadata:Bibliography",tags,file,itemType,collection,public,featured
"La fuite en Egypte.",,,,,,,,,,"Image mi-page","français ; latin","Gravure sur cuivre",PAT_18G_001_173b,,,,,,,,,,,,,,,,,,,,,,,,,,,,,,,,,,,,"Âne,Enfance du Christ,Enfant Jésus,Évangile selon saint Matthieu,Fuite en Égypte,Saint Joseph,Sainte Famille,Statue,Vierge,Voyage,Voyageur",https://hieronyma.ict-toulouse.fr/files/original/e845689089f70dee5c433a59aac7cdee.JPG,,"L'Ancien et le Nouveau Testament représentés en cinq cens tableaux gravés d'après les desseins de Raphaël & autres grands maîtres et expliqués par les paroles de l'Ecriture",1,0
"L'anesse de Balaam parle.",,,,,,,,,,"Image mi-page","français ; latin","Gravure sur cuivre",PAT_18G_001_079_web_b,,,,,,,,,,,,,,,,,,,,,,,,,,,,,,,,,,,,"Âne,Ange,Apparition,Balaam,Chemin,Épée,Feu,Livre des Nombres,Prodige",https://hieronyma.ict-toulouse.fr/files/original/f5d7cc56ab8766380eaf1aa7a1ab4c99.JPG,,"L'Ancien et le Nouveau Testament représentés en cinq cens tableaux gravés d'après les desseins de Raphaël & autres grands maîtres et expliqués par les paroles de l'Ecriture",1,0
"Jesus-Christ Nait a Bethléhem",,,,,,,,,,"Image mi-page","français ; latin","Gravure sur cuivre",PAT_18G_001_169b,,,,,,,,,,,,,,,,,,,,,,,,,,,,,,,,,,,,"Âne,Ange,Apparition,Bethléem,Boeuf,Christ,Enfance du Christ,Enfant Jésus,Étable,Évangile selon saint Luc,Nativité,Rayons lumineux,Saint Joseph,Vierge",https://hieronyma.ict-toulouse.fr/files/original/e133c2bab6f9cae7daa724445b31d6d8.JPG,,"L'Ancien et le Nouveau Testament représentés en cinq cens tableaux gravés d'après les desseins de Raphaël & autres grands maîtres et expliqués par les paroles de l'Ecriture",1,0
"Jesus monté sur un ânon entre en Jerusalem.",,,,,,,,,,"Image mi-page","français ; latin","Gravure sur cuivre",PAT_18G_001_206a,,,,,,,,,,,,,,,,,,,,,,,,,,,,,,,,,,,,"Âne,Branche,Christ,Entrée à Jérusalem,Évangile selon saint Matthieu,Foule,Jérusalem,Manteau,Passion",https://hieronyma.ict-toulouse.fr/files/original/ec1000ab223a65477cfad735f4d721d4.JPG,,"L'Ancien et le Nouveau Testament représentés en cinq cens tableaux gravés d'après les desseins de Raphaël & autres grands maîtres et expliqués par les paroles de l'Ecriture",1,0
"Fuite en Égypte",,,,,,,,,,Planche,,"Gravure sur acier",1133_SAI_2_037_web,,,,,,,,,,,,,,,,,,,,,,,,,,,,,,,,,,,,"Âne,Désert,Enfance du Christ,Enfant Jésus,Évangile selon saint Matthieu,Fuite en Égypte,Saint Joseph,Vierge,Voyage",https://hieronyma.ict-toulouse.fr/files/original/c884e68add3d5e80040cdfcc8d449818.JPG,,"La Sainte Bible : traduction nouvelle selon la Vulgate",1,0
"Fuga in Egitto",,,,,,,,,,Vignette,,"Gravure sur cuivre",CAP_18P_084_019_web,,,,,,,,,,,,,,,,,,,,,,,,,,,,,,,,,,,,"Âne,Ange,Enfance du Christ,Enfant Jésus,Fuite en Égypte,Nouveau Testament,Palmier,Saint Joseph,Sainte Famille,Transport à dos d'animal,Vierge,Voyage,Voyageur",https://hieronyma.ict-toulouse.fr/files/original/abcaa97aa894fa51992e44ea901c64e9.JPG,"Image fixe","La Santa infanzia di Gesu bambino",1,0
"Famine au siége de Samarie",,,,,,,,,,"Image mi-page","français ; latin","Gravure sur cuivre",PAT_18G_001_131a,,,,,,,,,,,,,,,,,,,,,,,,,,,,,,,,,,,,"Âne,Commerçant,Deuxième Livre des Rois,Famine,Guerre de siège,Tête d'animal,Ville",https://hieronyma.ict-toulouse.fr/files/original/539274224ca83c7d1abe17113fff2479.JPG,,"L'Ancien et le Nouveau Testament représentés en cinq cens tableaux gravés d'après les desseins de Raphaël & autres grands maîtres et expliqués par les paroles de l'Ecriture",1,0
"Entrée de Jésus à Jérusalem.",,,,,,,,,,Planche,,"Gravure sur acier",1133_SAI_2_070_web,,,,,,,,,,,,,,,,,,,,,,,,,,,,,,,,,,,,"Âne,Branche,Christ,Entrée à Jérusalem,Évangile selon saint Matthieu,Foule,Jérusalem,Petit d'animal,Prosterné",https://hieronyma.ict-toulouse.fr/files/original/07a1723f887b7d049468afd91d17e109.JPG,,"La Sainte Bible : traduction nouvelle selon la Vulgate",1,0
"Deffaite des Philistains",,,,,,,,,,"Image mi-page","français ; latin","Gravure sur cuivre",PAT_18G_001_094_web_a,,,,,,,,,,,,,,,,,,,,,,,,,,,,,,,,,,,,"Âne,Ange,Apparition,Boisson,Cadavre,Champ,Dieu le Père,Eau,Livre des Juges,Miracle,Os d'animal,Samson",https://hieronyma.ict-toulouse.fr/files/original/718ad16bb54cd20c9b8c6941693cbf7c.JPG,,"L'Ancien et le Nouveau Testament représentés en cinq cens tableaux gravés d'après les desseins de Raphaël & autres grands maîtres et expliqués par les paroles de l'Ecriture",1,0
"D'un Taureau, et d'un Renard.",,,,,,,,,,Vignette,,"Gravure sur cuivre",PAT_17P_547_026_web,,,,,,,,,,,,,,,,,,,,,,,,,,,,,,,,,,,,"Âne,Animal,Chèvre,Chien,Colère,Coup d'Etat,Fable,Lion,Taureau",https://hieronyma.ict-toulouse.fr/files/original/907e1122c5aeb37dca5daca101544b00.JPG,"Image fixe","Esope en belle humeur",1,0
