﻿"Dublin Core:Title","Dublin Core:Subject","Dublin Core:Description","Dublin Core:Creator","Dublin Core:Source","Dublin Core:Publisher","Dublin Core:Date","Dublin Core:Contributor","Dublin Core:Rights","Dublin Core:Relation","Dublin Core:Format","Dublin Core:Language","Dublin Core:Type","Dublin Core:Identifier","Dublin Core:Coverage","Item Type Metadata:Text","Item Type Metadata:Interviewer","Item Type Metadata:Interviewee","Item Type Metadata:Location","Item Type Metadata:Transcription","Item Type Metadata:Local URL","Item Type Metadata:Original Format","Item Type Metadata:Physical Dimensions","Item Type Metadata:Duration","Item Type Metadata:Compression","Item Type Metadata:Producer","Item Type Metadata:Director","Item Type Metadata:Bit Rate/Frequency","Item Type Metadata:Time Summary","Item Type Metadata:Email Body","Item Type Metadata:Subject Line","Item Type Metadata:From","Item Type Metadata:To","Item Type Metadata:CC","Item Type Metadata:BCC","Item Type Metadata:Number of Attachments","Item Type Metadata:Standards","Item Type Metadata:Objectives","Item Type Metadata:Materials","Item Type Metadata:Lesson Plan Text","Item Type Metadata:URL","Item Type Metadata:Event Type","Item Type Metadata:Participants","Item Type Metadata:Birth Date","Item Type Metadata:Birthplace","Item Type Metadata:Death Date","Item Type Metadata:Occupation","Item Type Metadata:Biographical Text","Item Type Metadata:Bibliography",tags,file,itemType,collection,public,featured
"[Un ange extermine l'armée des Assyriens]",,,,,,,,,,Vignette,,"Gravure sur bois",PAT_16M_022_220_web,,,,,,,,,,,,,,,,,,,,,,,,,,,,,,,,,,,,"Ange,Apparition,Armée,Cavalier,Deuxième Livre des Rois,Épée,Mort,Tente",https://hieronyma.ict-toulouse.fr/files/original/ef5067d11019b9f30c804ccc1db1b629.jpg,"Image fixe","[Bible, latin, 1574]",1,0
"[Suicide de Saül]",,,,,,,,,,"Pleine page",,"Gravure sur bois",PAT_16M_022_169_web,,,,,,,,,,,,,,,,,,,,,,,,,,,,,,,,,,,,"Armée,Défaite,Mort par le fer,Premier Livre de Samuel,Saül,Serviteur,Suicide",https://hieronyma.ict-toulouse.fr/files/original/625923298e11c593168a4c5591c64e81.JPG,"Image fixe","[Bible, latin, 1574]",1,0
"[Livre sixième]",,,,,,,,,,"Image pleine page",,"Gravure sur cuivre",PAT_17P_688_009_web,,,,,,,,,,,,,,,,,,,,,,,,,,,,,,,,,,,,"Ange,Armée,Bataille,Diable,En vol,Jeanne d'Arc (1412-1431, sainte),Rempart",https://hieronyma.ict-toulouse.fr/files/original/9b3c7a0c439504f03d5c5032723bf832.jpg,,"La pucelle, : ou la France délivrée : poëme héroïque / par M. Chapelain",1,0
"[Livre douzième]",,,,,,,,,,"Image pleine page",,"Gravure sur cuivre",PAT_17P_688_021_web,,,,,,,,,,,,,,,,,,,,,,,,,,,,,,,,,,,,"Armée,Cadavre,Cavalier,Paris",https://hieronyma.ict-toulouse.fr/files/original/e8106051a6a73f0c183bb22bbcfa0096.jpg,,"La pucelle, : ou la France délivrée : poëme héroïque / par M. Chapelain",1,0
"[Livre dixième]",,,,,,,,,,"Image pleine page",,"Gravure sur cuivre",PAT_17P_688_017_web,,,,,,,,,,,,,,,,,,,,,,,,,,,,,,,,,,,,"Armée,Bataille,Incendie,Ville",https://hieronyma.ict-toulouse.fr/files/original/bfcbf3bf1d5295dfbb284a0dbf33d008.jpg,,"La pucelle, : ou la France délivrée : poëme héroïque / par M. Chapelain",1,0
"[Les rois d'Israël, de Juda et d'Édom consultent Élisée]",,,,,,,,,,Vignette,,"Gravure sur bois",PAT_16M_022_209_web,,,,,,,,,,,,,,,,,,,,,,,,,,,,,,,,,,,,"Armée,Cavalier,Deuxième Livre des Rois,Élisée,Joram d'Israël,Josaphat,Roi",https://hieronyma.ict-toulouse.fr/files/original/b0dd8098ad990fe1133520e1de0e95f7.jpg,"Image fixe","[Bible, latin, 1574]",1,0
"[Les Assyriens s'enfuient après la mort d'Holopherne]",,,,,,,,,,Vignette,,"Gravure sur bois",PAT_16M_022_247_web,,,,,,,,,,,,,,,,,,,,,,,,,,,,,,,,,,,,"Armée,Bataille,Holopherne,Livre de Judith,Mort,Poursuite militaire,Rempart,Tente,Tête,Trompe",https://hieronyma.ict-toulouse.fr/files/original/2498375562677dfdd44042c52c5a3a29.JPG,"Image fixe","[Bible, latin, 1574]",1,0
"[Le roi de Sodome vient à la rencontre d'Abraham. La rencontre d'Abraham et Melchisédech]",,,,,,,,,,"Pleine page",,"Gravure sur bois",PAT_16M_022_014_web,,,,,,,,,,,,,,,,,,,,,,,,,,,,,,,,,,,,"Abraham,Armée,Livre de la Genèse,Melchisédech,Offrande,Pain,Porte,Prêtre,Rencontre,Révérence,Roi,Sodome,Vin",https://hieronyma.ict-toulouse.fr/files/original/56efa93b7674b6a7bfad71bd573d2532.jpg,"Image fixe","[Bible, latin, 1574]",1,0
"[Le roi d'Égypte emporte les trésors du Temple]",,,,,,,,,,Vignette,,"Gravure sur bois",PAT_16M_022_231_web,,,,,,,,,,,,,,,,,,,,,,,,,,,,,,,,,,,,"Armée,Deuxième Livre des Chroniques,L'arche d'alliance,Le chandelier à sept branches,Le Temple,Objet biblique,Objet du culte,Pillage,Roi",https://hieronyma.ict-toulouse.fr/files/original/48cbd6b73bde2e9c03d15a993c7e506d.jpg,"Image fixe","[Bible, latin, 1574]",1,0
"[Le passage du Jourdain]",,,,,,,,,,"Pleine page",,"Gravure sur bois",PAT_16M_022_123_web,,,,,,,,,,,,,,,,,,,,,,,,,,,,,,,,,,,,"Armée,Fleuve,Jourdain,L'arche d'alliance,Livre de Josué,Prêtre",https://hieronyma.ict-toulouse.fr/files/original/728188f4243cf39abc669fb98a62cf3a.JPG,"Image fixe","[Bible, latin, 1574]",1,0
