﻿"Dublin Core:Title","Dublin Core:Subject","Dublin Core:Description","Dublin Core:Creator","Dublin Core:Source","Dublin Core:Publisher","Dublin Core:Date","Dublin Core:Contributor","Dublin Core:Rights","Dublin Core:Relation","Dublin Core:Format","Dublin Core:Language","Dublin Core:Type","Dublin Core:Identifier","Dublin Core:Coverage","Item Type Metadata:Text","Item Type Metadata:Interviewer","Item Type Metadata:Interviewee","Item Type Metadata:Location","Item Type Metadata:Transcription","Item Type Metadata:Local URL","Item Type Metadata:Original Format","Item Type Metadata:Physical Dimensions","Item Type Metadata:Duration","Item Type Metadata:Compression","Item Type Metadata:Producer","Item Type Metadata:Director","Item Type Metadata:Bit Rate/Frequency","Item Type Metadata:Time Summary","Item Type Metadata:Email Body","Item Type Metadata:Subject Line","Item Type Metadata:From","Item Type Metadata:To","Item Type Metadata:CC","Item Type Metadata:BCC","Item Type Metadata:Number of Attachments","Item Type Metadata:Standards","Item Type Metadata:Objectives","Item Type Metadata:Materials","Item Type Metadata:Lesson Plan Text","Item Type Metadata:URL","Item Type Metadata:Event Type","Item Type Metadata:Participants","Item Type Metadata:Birth Date","Item Type Metadata:Birthplace","Item Type Metadata:Death Date","Item Type Metadata:Occupation","Item Type Metadata:Biographical Text","Item Type Metadata:Bibliography",tags,file,itemType,collection,public,featured
"Le Corps de Saul enlevé par les habitans de Jabes",,,,,,,,,,"Image mi-page","français ; latin","Gravure sur cuivre",PAT_18G_001_111_web_b,,,,,,,,,,,,,,,,,,,,,,,,,,,,,,,,,,,,"Cadavre,Ensevelissement,Jonathan fils de Saül,Nuit,Premier Livre de Samuel,Rempart,Saül,Ville",https://hieronyma.ict-toulouse.fr/files/original/845ec4c8f207597ae523de191c534e27.JPG,,"L'Ancien et le Nouveau Testament représentés en cinq cens tableaux gravés d'après les desseins de Raphaël & autres grands maîtres et expliqués par les paroles de l'Ecriture",1,0
"Les habitants de Jabès-Galaad recueillent les corps de Saül et de ses fils.",,,,,,,,,,Planche,,"Gravure sur acier",1133_SAI_1_077_web,,,,,,,,,,,,,,,,,,,,,,,,,,,,,,,,,,,,"Cadavre,Premier Livre de Samuel,Rempart,Rite funèbre,Saül",https://hieronyma.ict-toulouse.fr/files/original/55bdb81fa86d829888660dd269ab6c4a.JPG,"Image fixe","La Sainte Bible : traduction nouvelle selon la Vulgate",1,0
"Les philistins renvoyent l'arche avec des présents",,,,,,,,,,"Image mi-page","français ; latin","Gravure sur cuivre",PAT_18G_001_100_web_b,,,,,,,,,,,,,,,,,,,,,,,,,,,,,,,,,,,,"Blé,Champ,Char,Don,L'arche d'alliance,Moisson,Premier Livre de Samuel,Retour,Soldat,Vache",https://hieronyma.ict-toulouse.fr/files/original/6ebd67db38b843356feb9e9a44bd002b.JPG,,"L'Ancien et le Nouveau Testament représentés en cinq cens tableaux gravés d'après les desseins de Raphaël & autres grands maîtres et expliqués par les paroles de l'Ecriture",1,0
"Michol fait sauver David.",,,,,,,,,,"Image mi-page","français ; latin","Gravure sur cuivre",PAT_18G_001_106_web_a,,,,,,,,,,,,,,,,,,,,,,,,,,,,,,,,,,,,"David,Fuite,Lien,Lit,Michol,Nuit,Premier Livre de Samuel,Soldat,Statue",https://hieronyma.ict-toulouse.fr/files/original/b836360f2456128948fef8edc275c7d2.JPG,,"L'Ancien et le Nouveau Testament représentés en cinq cens tableaux gravés d'après les desseins de Raphaël & autres grands maîtres et expliqués par les paroles de l'Ecriture",1,0
"Mort de Saül.",,,,,,,,,,Planche,,"Gravure sur acier",1133_SAI_1_076_web,,,,,,,,,,,,,,,,,,,,,,,,,,,,,,,,,,,,"Armée,Cheval,Défaite,Épée,Mort par le fer,Premier Livre de Samuel,Saül,Suicide",https://hieronyma.ict-toulouse.fr/files/original/baf1148b868efb26492ac3d462b731bd.JPG,"Image fixe","La Sainte Bible : traduction nouvelle selon la Vulgate",1,0
"Philistins défaits par Jonathas, et son ecuyer.",,,,,,,,,,"Image mi-page","français ; latin","Gravure sur cuivre",PAT_18G_001_102_web_a,,,,,,,,,,,,,,,,,,,,,,,,,,,,,,,,,,,,"Combat,Écuyer,Falaise,Jonathan fils de Saül,Premier Livre de Samuel,Soldat,Tente",https://hieronyma.ict-toulouse.fr/files/original/886216e11b51bdb3bacae74f7bc8ef73.JPG,,"L'Ancien et le Nouveau Testament représentés en cinq cens tableaux gravés d'après les desseins de Raphaël & autres grands maîtres et expliqués par les paroles de l'Ecriture",1,0
"Retour de l'Arche.",,,,,,,,,,Planche,,"Gravure sur acier",1133_SAI_1_070_web,,,,,,,,,,,,,,,,,,,,,,,,,,,,,,,,,,,,"Blé,Champ,L'arche d'alliance,Moisson,Premier Livre de Samuel",https://hieronyma.ict-toulouse.fr/files/original/1f9e740eebdac334176fe8ab48df85c0.JPG,"Image fixe","La Sainte Bible : traduction nouvelle selon la Vulgate",1,0
"Samuel fait mettre à mort Agag.",,,,,,,,,,Planche,,"Gravure sur acier",1133_SAI_1_071_web,,,,,,,,,,,,,,,,,,,,,,,,,,,,,,,,,,,,"Agag,Épée,Mort par le fer,Peine de mort,Premier Livre de Samuel,Samuel",https://hieronyma.ict-toulouse.fr/files/original/6201408bdaa8331426d790f3e85e773c.JPG,"Image fixe","La Sainte Bible : traduction nouvelle selon la Vulgate",1,0
"Samuel Juge Israel a Masphat",,,,,,,,,,"Image mi-page","français ; latin","Gravure sur cuivre",PAT_18G_001_101_web_a,,,,,,,,,,,,,,,,,,,,,,,,,,,,,,,,,,,,"Autel,Eau,Foule,Premier Livre de Samuel,Rite de purification,Samuel,Ville",https://hieronyma.ict-toulouse.fr/files/original/bc07c78bd7d0380fbc063f7076156ecf.JPG,,"L'Ancien et le Nouveau Testament représentés en cinq cens tableaux gravés d'après les desseins de Raphaël & autres grands maîtres et expliqués par les paroles de l'Ecriture",1,0
"Samuel oint Saul roi.",,,,,,,,,,"Image mi-page","français ; latin","Gravure sur cuivre",PAT_18G_001_101_web_b,,,,,,,,,,,,,,,,,,,,,,,,,,,,,,,,,,,,"Huile,Premier Livre de Samuel,Rempart,Sacre,Samuel,Saül,Ville",https://hieronyma.ict-toulouse.fr/files/original/c33c90fb3a76b5392e92bdcd2759e42c.JPG,,"L'Ancien et le Nouveau Testament représentés en cinq cens tableaux gravés d'après les desseins de Raphaël & autres grands maîtres et expliqués par les paroles de l'Ecriture",1,0
